Repository Date
type: Property
comment: The date this competency framework was added to the repository.
term status: stable
change history: https://credreg.net/ctdlasn/termhistory/ceasn/repositoryDate/json
domain includes: CompetencyFramework
range includes: date
equivalent property: repositoryDate