Rights Holder
type: Property
comment: An agent owning or managing rights over this resource.
term status: stable
change history: https://credreg.net/ctdlasn/termhistory/ceasn/rightsHolder/json
domain includes: ProgressionModel
domain includes: CompetencyFramework
domain includes: PriorLearningPolicy
domain includes: TransferAgreement
domain includes: ConceptScheme
range includes: CredentialOrganization
range includes: Organization
range includes: QACredentialOrganization
equivalent property: rightsHolder