Source Documentation
type: Property
comment: Human-readable information resource other than a competency framework from which this resource was generated or identified by humans or machines.
description: The intended use case for this is when documentation is analyzed in order to find and describe entities such as competencies and concepts.
term status: unstable
change history: https://credreg.net/ctdlasn/termhistory/ceasn/sourceDocumentation/json
domain includes: Competency
domain includes: CompetencyFramework
domain includes: AlignmentMap
domain includes: QualificationsFramework
domain includes: Concept
domain includes: ConceptScheme
range includes: anyURI