Substantiating Competency Framework
type: Property
comment: Aspects of the referenced Competency Framework provide some justification that the resource being described is useful.
term status: unstable
change history: https://credreg.net/ctdlasn/termhistory/ceasn/substantiatingCompetencyFramework/json
sub property of: substantiatingResource
domain includes: Competency
range includes: CompetencyFramework