Top Concept Of
type: Property
comment: Concept scheme for which this concept is a top node in a hierarchy of concepts.
term status: stable
change history: https://credreg.net/ctdlasn/termhistory/skos/topConceptOf/json
domain includes: ProgressionLevel
domain includes: Concept
range includes: ProgressionModel
range includes: ConceptScheme