Weight
type: Property
comment: An asserted measurement of the weight, degree, percent, or strength of a recommendation, requirement, or comparison.
description: Best practice is to assign a decimal value weight between 0 and 1 that indicates the strength of the assertion, with 0 being weakest and 1 being strongest.
term status: stable
change history: https://credreg.net/ctdlasn/termhistory/ceasn/weight/json
domain includes: Competency
domain includes: RubricCriterion
range includes: float
equivalent property: weight