Academic Certificate
type: Class
comment: Credential awarded for successful completion of a formal education program, demonstrating requisite knowledge and skills.
description: Formal education programs include academic, career, technical programs with defined completion requirements and often require approvals by provincial or federal government.
term status: unstable
subclass of: Certificate

Accredit Action
type: Class
comment: Action by an independent, neutral, and authoritative agent that certifies an entity as meeting a prescribed set of standards.
description: Since an instance of ceterms:CredentialingAction is a claim that a certain agent has taken the action being described, creation of such a ceterms:CredentialingAction should be reserved to the agent of that action.
term status: stable
subclass of: Credentialing Action

Advanced Standing Action
type: Class
comment: Claim by an agent asserting that the object credential of the action provides advanced standing for a credential under the asserting agent's authority.
description: Since an instance of ceterms:CredentialingAction is a claim that a certain agent has taken the action being described, creation of such a ceterms:CredentialingAction should be reserved to the agent of that action.
term status: stable
subclass of: Credentialing Action

Agent
type: Class
comment: Organization or person that acts or has the power to act.
description: Broad type that includes both organizations and people who play roles in the lifecycle of a resource.
term status: stable
equivalent class: Agent

Aggregate Data Profile
type: Class
comment: Resource containing summary statistical data.
usage note: To express more complex data, use qdata:DataSetProfile.
term status: stable

Alignment Map
type: Class
comment: Entity comprised of a set of alignment or mapping assertions between two existing entities.
description: Alignment maps provide the means for parties to assert sets of alignments between already existing entities created by themselves or other parties.
term status: stable

Alignment Object
type: Class
comment: Entity describing the relationship between two nodes in different frameworks.
description: "Frameworks" may be interpreted broadly to include any scheme or schema for organizing and referencing resources.
usage note: Used to compare concepts in concept schemes, levels in progression models, types of resource in an ontology etc.
term status: unstable

Apprentice Certificate
type: Class
comment: Credential awarded at the Apprentice level for successful completion of an apprenticeship program in industry trades and professions.
term status: stable
subclass of: Work-Based Learning Certificate

Approve Action
type: Class
comment: Action by an independent, neutral, and authoritative agent that pronounces a favorable judgment of a credential.
description: Since an instance of ceterms:CredentialingAction is a claim that a certain agent has taken the action being described, creation of such a ceterms:CredentialingAction should be reserved to the agent of that action.
term status: unstable
subclass of: Credentialing Action

Assessment
type: Class
comment: Direct, indirect, formative, and summative evaluation or estimation of the nature, ability, or quality of an entity, performance, or outcome of an action.
term status: stable

Assessment Component
type: Class
comment: Resource that identifies a direct, indirect, formative, and summative evaluation or estimation of the nature, ability, or quality of a resource, performance, or outcome of an action.
description: Instances act as proxies or stand-ins for other resources in the context of a particular pathway so that relationships between them as components of that pathway can be stated without implying that the those relationships are true of the resources in other contexts.
term status: stable
subclass of: Pathway Component

Assessment Profile
type: Class
comment: Entity that describes the key characteristics of an assessment for a credential.
description: Characteristics described include, but are not limited to, processes for assessment development, maintenance, selection and evaluation as well as assessment examples.
usage note: The ceterms:AssessmentProfile is intended for use in describing stand-alone assessments. Assessments that are a part of a learning opportunity associated with a credential should be described as part the ceterms:LearningOpportunityProfile for that learning opportunity.
term status: stable
subclass of: CreativeWork

Associate Degree
type: Class
comment: College/university award for students typically completing the first two years of full-time postsecondary school education.
description: Equivalent to an award at UNESCO ISCED 2011, Level 5, and United States IPEDS Award Level 3.
usage note: Use this class for types of Associate Degrees that are not covered by more specific subtypes.
term status: stable
subclass of: Degree
equivalent class: Q14625016

Associate of Applied Arts Degree
type: Class
comment: College/university award for students typically completing two years of full-time postsecondary school education in a technical, professional, or vocational program with an emphasis on direct employment in the arts and social sciences fields.
description: Equivalent to an award at UNESCO ISCED 2011, Level 5, and United States IPEDS Award Level 3.
usage note: Use the name property to capture local variations on what this class covers.
term status: unstable
subclass of: Associate Degree

Associate of Applied Science Degree
type: Class
comment: College/university award for students typically completing two years of full-time postsecondary school education in a technical, professional, or vocational program with an emphasis on direct employment in applied scientific and technological fields.
description: Equivalent to an award at UNESCO ISCED 2011, Level 5, and United States IPEDS Award Level 3.
usage note: Use the name property to capture local variations on what this class covers.
term status: unstable
subclass of: Associate Degree

Associate of Arts Degree
type: Class
comment: College/university award for students typically completing the first two years of full-time postsecondary school education with an emphasis in the liberal arts and sciences such as the humanities and social science fields.
description: Equivalent to an award at UNESCO ISCED 2011, Level 5, and United States IPEDS Award Level 3.
usage note: Use the name property to capture local variations on what this class covers.
term status: unstable
subclass of: Associate Degree

Associate of Science Degree
type: Class
comment: College/university award for students typically completing the first two years of full-time postsecondary school education with an emphasis in scientific and technical fields and professional fields of study.
description: Equivalent to an award at UNESCO ISCED 2011, Level 5, and United States IPEDS Award Level 3.
usage note: Use the name property to capture local variations on what this class covers.
term status: unstable
subclass of: Associate Degree

Bachelor's Degree
type: Class
comment: College/university award for students typically completing three to five years of education where course work and activities advance skills beyond those of the first one to two years of college/university study.
description: Equivalent to an award at UNESCO ISCED 2011, Level 6, and United States IPEDS Award Level 5.
usage note: Use for 5-year cooperative (work-study) programs. A cooperative plan provides for alternate class attendance and employment in business, industry, or government; thus, it allows students to combine actual work experience with their college studies. Also includes bachelor's degrees in which the normal 4 years of work are completed in 3 years.
term status: stable
subclass of: Degree
equivalent class: Q163727

Bachelor of Arts Degree
type: Class
comment: College/university award for students typically completing three to five years of education where course work and activities advance skills beyond those of the first one to two years of college/university study, with an emphasis in the liberal arts and sciences such as the humanities and social science fields.
description: Equivalent to an award at UNESCO ISCED 2011, Level 6, and United States IPEDS Award Level 5.
usage note: Use the name property to capture local variations on what this class covers.
term status: unstable
subclass of: Bachelor's Degree

Bachelor of Science Degree
type: Class
comment: College/university award for students typically completing three to five years of education where course work and activities advance skills beyond those of the first one to two years of college/university study, with an emphasis in scientific and technical fields and professional fields of study.
description: Equivalent to an award at UNESCO ISCED 2011, Level 6, and United States IPEDS Award Level 5.
usage note: Use the name property to capture local variations on what this class covers.
term status: unstable
subclass of: Bachelor's Degree

Badge
type: Class
comment: Recognition designed to be displayed as a marker of accomplishment, activity, achievement, skill, interest, association, or identity.
term status: stable
subclass of: Credential

Basic Component
type: Class
comment: Resource that identifies a resource not otherwise covered by the enumerated PathwayComponent subclasses.
description: Instances act as proxies or stand-ins for other resources in the context of a particular pathway so that relationships between them as components of that pathway can be stated without implying that the those relationships are true of the resources in other contexts.
term status: stable
subclass of: Pathway Component

Basic Technical Certificate
type: Class
comment: Credential awarded at a postsecondary level for successful completion of a formal education program that is completed within one semester, demonstrating competencies within a specific occupational area, indicating job readiness.
description: Typically equivalent to a United States IPEDS level 1a that specifies postsecondary certificates of less than 300 clock hours, or less than 9 semester or trimester credit hours, or less than 13 quarter credit hours and UNESCO ISCED 2011 Levels 3 or 4.
term status: unstable
subclass of: Academic Certificate

Certificate
type: Class
comment: Credential which designates participation in, completion of, or demonstration of requisite knowledge and skills for a formal academic or training program, an occupation, or non-formal learning.
description: Distinct from degrees of higher education and typically non-renewable. For degrees of higher education use an appropriate type from the Degree hierarchy.
term status: stable
subclass of: Credential

Certificate of Completion
type: Class
comment: Credential that acknowledges completion of an assignment, training or other activity.
description: A record of the activity may or may not exist, and the credential may or may not be designed as preparation for another resource such as a credential, assessment, or learning opportunity.
term status: stable
subclass of: Certificate

Certificate of Participation
type: Class
comment: Credential that acknowledges attendance and/or engagement in an activity.
description: These certificates do not imply completion, or mastery of specific skills, or that a grade has been awarded, but recognize the individual's active participation with an activity. A record of the activity may or may not exist, and the credential may or may not be designed as preparation for another resource such as a credential, assessment, or learning opportunity.
term status: unstable
subclass of: Certificate

Certification
type: Class
comment: Time-limited, revocable, renewable credential awarded by an authoritative body for demonstrating the knowledge, skills, and abilities to perform specific tasks or an occupation.
description: Certifications can typically be revoked if not renewed, for a violation of a code of ethics (if applicable) or proven incompetence after due process. Description of revocation criteria for a specific Certification should be defined using Revocation Profile.
term status: stable
subclass of: Credential

Cocurricular Component
type: Class
comment: Resource that identifies an activity, program, or informal learning experience such as a civic or service activity that supplements and complements the curriculum.
description: Instances act as proxies or stand-ins for other resources in the context of a particular pathway so that relationships between them as components of that pathway can be stated without implying that the those relationships are true of the resources in other contexts.
term status: stable
subclass of: Pathway Component

Collection
type: Class
comment: Aggregation of related resources.
term status: unstable

Collection Component
type: Class
comment: Resource that is a proxy for the entities contained in or referenced by an external Collection, Framework, or other such list, or for the list itself.
usage note: Completion or satisfaction of this Component entails completion or satisfaction of all members of the referenced list, unless otherwise indicated by Constraints or other relevant information.
term status: unstable

Collection Member
type: Class
comment: Provides information about the membership of a resource in a Collection.
description: Instances act as proxies or stand-ins for other resources in the context of a particular collection so that the relationships between them and the collection can be stated without implying that those relationships are true in other contexts.
usage note: The data recorded for a Collection Member should refer to the membership of the resource in a Collection.
term status: unstable

Competency Component
type: Class
comment: Resource that identifies a measurable or observable knowledge, skill, or ability necessary to successful performance of a person in a given context.
description: Competency is broadly defined to include assertions of academic, professional, occupational, vocational and life goals, outcomes, and standards, however labeled. Instances act as proxies or stand-ins for other resources in the context of a particular pathway so that relationships between them as components of that pathway can be stated without implying that the those relationships are true of the resources in other contexts.
term status: stable
subclass of: Pathway Component

Component Condition
type: Class
comment: Resource that describes what must be done to complete a PathwayComponent, or part thereof, as determined by the issuer of the Pathway.
description: A ComponentCondition references a single RuleSet defining appropriate values fulfilling the condition.
term status: stable

Condition Manifest
type: Class
comment: Set of constraints, prerequisites, entry conditions, or requirements maintained at the organizational and/or sub-organizational level.
description: These conditions are intended to be referenced by external entities such as individual credentials in order to facilitate the process of their description and to reduce unnecessary duplication of data applicable across an array of entities.
term status: stable

Condition Profile
type: Class
comment: Entity describing a constraint, prerequisite, entry condition, or requirement.
description: Constraints exist with credentials, learning opportunities, assessments and other entities to which they are subject during their lifecycles. In certain circumstances, the condition profile can be read as a description of a Person who meets the conditions.
term status: stable
subclass of: CreativeWork

Constraint
type: Class
comment: Resource that identifies the parameters defining a limitation or restriction applicable to candidate pathway components.
term status: unstable

Constraint Rule
type: Class
comment: Abstract class of executable constraints.
description: An instance of the Constraint Rule class is a deployable machine solution for executing pathway constraints using specifications such as XPath, JSONPath, JsonLogic, ShEx, SHACL, BPMN, XPDL and BPEL.
term status: unstable

Contact Point
type: Class
comment: Means of contacting an organization or its representative.
description: For example, a public relations email address or phone number.
term status: stable
equivalent class: ContactPoint

Cost Manifest
type: Class
comment: Entity that describes a set of costs maintained at, and applicable across the organizational and/or sub-organizational level.
description: Instances of these ceterms:CostManifest entities are intended to be referenced by other entities to augment the process of describing their costs.
term status: stable

Cost Profile
type: Class
comment: Entity that describes direct costs one would incur if one were to pursue a credential, assessment, learning opportunity, or aspects thereof.
term status: stable
subclass of: CreativeWork

Course
type: Class
comment: Single structured sequence of one or more educational activities that aims to develop a prescribed set of competencies of learners.
description: Course is distinct from Program, which aggregates several courses.
term status: stable
subclass of: Learning Opportunity Profile
subclass of: CreativeWork
equivalent class: Course

Course Component
type: Class
comment: Resource that identifies a structured sequence of one or more learning activities that aims to develop a prescribed set of knowledge, skill, or ability of learners.
description: Instances act as proxies or stand-ins for other resources in the context of a particular pathway so that relationships between them as components of that pathway can be stated without implying that the those relationships are true of the resources in other contexts.
term status: stable
subclass of: Pathway Component

Credential
type: Class
comment: Qualification, achievement, personal or organizational quality, or aspect of an identity typically used to indicate suitability.
description: The ceterms:Credential class is broadly defined to encompass credentials used across domains and communities of practice. The class should be used only when speaking of credentials in general. Subclasses of ceterms:Credential as defined by Credential Engine (or other communities) should be used when referencing specific types of credentials.
term status: stable
subclass of: CreativeWork
equivalent class: BadgeClass

Credential Alignment Object
type: Class
comment: Entity describing an affiliation or association between an entity such as a credential, learning opportunity or assessment and another entity in a structured framework such as a concept scheme, enumerated list, or competency framework.
term status: stable
subclass of: AlignmentObject

Credential Assertion
type: Class
comment: Representation of a credential awarded to a person.
term status: stable
equivalent class: Assertion

Credential Component
type: Class
comment: Resource that identifies another resource that describes qualification, achievement, personal or organizational quality, or aspect of an identity typically used to indicate suitability.
description: The ceterms:Credential class is broadly defined to encompass credentials used across domains and communities of practice. Subclasses of ceterms:Credential as defined by Credential Engine (or other communities) should be referenced. Instances act as proxies or stand-ins for other resources in the context of a particular pathway so that relationships between them as components of that pathway can be stated without implying that the those relationships are true of the resources in other contexts.
term status: stable
subclass of: Pathway Component

Credential Framework
type: Class
comment: Class of all structured sets of conceptual entities intentionally designed for use as value vocabulary terms for description and classification in the credentialing context.
description: The class includes, but is not limited to, subclasses of specialized concept schemes describing industries, occupations, professions, learning contexts and jobs, as well as specialized subject concept schemes, assessment rubrics, proficiency scales, and competency frameworks.
term status: stable
equivalent class: EducationalFramework

Credentialing Action
type: Class
comment: Action taken by an agent affecting the status of an object entity.
description: Since an instance of ceterms:CredentialingAction is a claim that a certain agent has taken the action being described, creation of such a ceterms:CredentialingAction should be reserved to the agent of that action.
term status: stable

Credential Organization
type: Class
comment: Organization that plays one or more key roles in the lifecycle of a credential.
usage note: For organizations that are not a Credential Organization or a QA Credential Organization, use ceterms:Organization.
term status: stable
subclass of: Organization

CredentialPerson
type: Class
comment: Person who plays a role as primary agent in a credentialing action.
description: The ceterms:CredentialPerson class should be used to describe persons directly engaged as primary agent in credentialing actions such as approving, offering, recognizing, renewing and revoking credentials and should not include persons merely affiliated with, or employed by organizations that perform such actions.
term status: stable
subclass of: Agent
subclass of: Person

Credential Type
type: Class
comment: Type of credential as defined by an authoritative body for use within an officially regulated qualification system.
description: Examples include various qualifications such as generic types of degrees, diplomas and certificates that are defined with official standing in many countries with regulations concerning who can offer them and what is required to earn them. They are often referenced against the qualification framework for the relevant jurisdiction.
usage note: To be used as the value of the credentialType property with the nearest matching subclass of ceterms:Credential used as the value of the type property. The CredentialType allows similar credentials from different jurisdictions to be identified, compared and contrasted; the Credential Class allows grouping of broadly similar credentials.
term status: unstable

Degree
type: Class
comment: Academic credential conferred upon completion of a program or course of study, typically over multiple years at a college or university.
term status: stable
subclass of: Credential
equivalent class: Q189533

Digital Badge
type: Class
comment: Badge offered in digital form.
term status: stable
subclass of: Badge
equivalent class: Q5276041

Diploma
type: Class
comment: Credential awarded by educational institutions for successful completion of a course of study or its equivalent.
term status: stable
subclass of: Credential

Doctoral Degree
type: Class
comment: Highest credential award for students who have completed both a bachelor's degree and a master's degree or their equivalent as well as independent research and/or a significant project or paper.
description: Equivalent to UNESCO ISCED, Level 8 and United States IPEDS Award Levels 17, 18, and 19.
usage note: Use the name property to capture local variations on what this class covers.
term status: stable
subclass of: Degree
equivalent class: Q849697

Duration Profile
type: Class
comment: Entity describing the temporal aspects of a resource.
description: Temporal aspects include exact, minimum, and maximum timeframes of an activity.
term status: stable

Earnings Profile
type: Class
comment: Entity that describes earning and related statistical information for a given credential.
usage note: The use of ceterms:AggregateDataProfile instead of this class is strongly recommended.
term status: stable
subclass of: Aggregate Data Profile
subclass of: CreativeWork

Employment Outcome Profile
type: Class
comment: Entity that describes employment outcomes and related statistical information for a given credential.
usage note: The use of ceterms:AggregateDataProfile instead of this class is strongly recommended.
term status: stable
subclass of: Aggregate Data Profile
subclass of: CreativeWork

Evaluation Outcome
type: Class
comment: Entity that describes the results of a valuation or appraisal of a resource.
usage note: Do not use for test results or other outcomes of assessments of people.
term status: unstable

Extracurricular Component
type: Class
comment: Resource that identifies an activity, program, or informal learning experience that may be offered or provided by a school, college, or other organization that is not connected to a curriculum.
description: Instances act as proxies or stand-ins for other resources in the context of a particular pathway so that relationships between them as components of that pathway can be stated without implying that the those relationships are true of the resources in other contexts.
term status: stable
subclass of: Pathway Component

Financial Assistance Profile
type: Class
comment: Entity that describes financial assistance that is offered or available.
term status: stable

General Education Development (GED)
type: Class
comment: Credential awarded by examination that demonstrates that an individual has acquired secondary school-level academic skills.
description: Equivalent to a secondary school diploma, based on passing a state- or province-selected examination such as GED, HiSET, or TASC; or to an award at UNESCO ISCED 2011 Levels 2 or 3.
term status: stable
subclass of: Diploma

General Education Level 1 Certificate
type: Class
comment: Credential award at a postsecondary level for successful completion of general education courses that cover a broad range of foundational academic skills and takes less than 1 year.
description: Can lead to a General Education Certificate Level 2 or a degree. Equivalent to a United States IPEDS Award Level 1b that specifies postsecondary certificates of 300-899 clock hours, or 9-29 semester or trimester credit hours, or 13-44 quarter credit hours and UNESCO ISCED 2011 Level 4.
usage note: If the competencies are related to a specific subject area or occupational area use the Technical Level 1 or use a Higher Education Certificate.
term status: unstable
subclass of: Academic Certificate

General Education Level 2 Certificate
type: Class
comment: Credential award at a postsecondary level for successful completion of general education courses that takes at least 1 year that cover a broad range of foundational academic skills and takes less than 2 years to complete.
description: Can lead to a degree. Equivalent to a United States IPEDS Award Level 2 that specifies postsecondary certificates of at least 900 but less than 1,800 clock hours, or at least 30 but less than 60 semester or trimester credit hours, or at least 45 but less than 90 quarter credit hours and UNESCO ISCED 2011 Level 4.
usage note: If the competencies are related to a specific subject area or occupational area use the Technical Level 2 or use a Higher Education Certificate.
term status: unstable
subclass of: Academic Certificate

Geographic Coordinates
type: Class
comment: Geographic coordinates of a place or event including latitude and longitude as well as other locational information.
term status: stable
subclass of: StructuredValue
equivalent class: GeoCoordinates

Higher Education Level 1 Certificate
type: Class
comment: Credential awarded at the postsecondary level for successful completion of a formal higher education program that takes about one year in a specific subject.
description: Typically equivalent to 60 ECTS Credits at Level 5 in the European Qualifications Framework or UNESCO ISCED 2011 Level 5.
term status: unstable
subclass of: Academic Certificate

Higher Education Level 2 Certificate
type: Class
comment: Credential awarded at the postsecondary level for successful completion of a formal higher education program that takes about two years in a specific subject.
description: Typically equivalent to 120 ECTS Credits at Level 5 in the European Qualifications Framework and the Short Cycle in the Qualifications Framework of the European Higher Education Area, or UNESCO ISCED 2011 Level 5.
term status: unstable
subclass of: Academic Certificate

Holders Profile
type: Class
comment: Entity describing the count and related statistical information of holders of a given credential.
usage note: The use of ceterms:AggregateDataProfile instead of this class is strongly recommended.
term status: stable
subclass of: Aggregate Data Profile
subclass of: CreativeWork

Identifier Value
type: Class
comment: Means of identifying a resource, typically consisting of an alphanumeric token and a context or scheme from which that token originates.
usage note: Where a formal identification system exists for the identifier, recommended best practice is to use a string conforming to that system.
term status: stable

Industry
type: Class
comment: Broad category of economic activities encompassing various sectors.
term status: unstable

Industry Classification
type: Class
comment: Class of of concept schemes defining industries such as NAICS in the U.S. and ESCO in the European Union.
term status: stable
subclass of: Credential Framework

Instructional Program Classification
type: Class
comment: Class of concept schemes defining instructional program types such as the CIP codes in the U.S.
usage note: Class of concept schemes defining types
term status: stable
subclass of: Credential Framework

Job
type: Class
comment: Set of responsibilities based on work roles within an occupation as defined by an employer.
description: Job describes an abstraction or template that specific job postings or openings could be instances of.
term status: stable

Job Component
type: Class
comment: Resource that identifies a work position, employment, or occupation.
description: Instances act as proxies or stand-ins for other resources in the context of a particular pathway so that relationships between them as components of that pathway can be stated without implying that the those relationships are true of the resources in other contexts.
term status: stable
subclass of: Pathway Component

Journeyman Certificate
type: Class
comment: Credential awarded at the Journeyman level for successful completion of an apprenticeship program in industry trades and professions.
term status: stable
subclass of: Work-Based Learning Certificate

Jurisdiction Profile
type: Class
comment: Geo-political information about applicable geographic areas and their exceptions.
term status: stable
subclass of: CreativeWork

Learning Opportunity
type: Class
comment: Structured and unstructured learning and development opportunities based in direct experience, formal and informal study, observation, and involvement in discourse and practice.
description: Examples of learning opportunities include education and training programs and classes, courses of study, apprenticeship or work experience programs, or other structured experiences intended to serve as educational or training events.
usage note: Classes of learning opportunities defined in other namespaces such as schema.org/Course may be declared as equivaleny or subclasses of ceterms:LearningOpportunity to support their discovery through applications processing CTDL data.
term status: stable

Learning Opportunity Profile
type: Class
comment: Entity describing an educational or training opportunity.
description: Opportunities include formal and informal educational training programs and classes, apprenticeship or work experience programs, or other structured or unstructured experiences that serve as educational or training activities.
term status: stable
subclass of: CreativeWork

Learning Program
type: Class
comment: Set of learning opportunities that leads to an outcome, usually a credential like a degree or certificate.
term status: unstable
subclass of: Learning Opportunity Profile
subclass of: EducationalOccupationalProgram

Learning Resource
type: Class
comment: Entity that is used as part of an learning activity (e.g. a textbook) or that describes (e.g. a lesson plan) or records the educational activity (e.g. an audio- or video-recording of a lesson).
term status: stable
subclass of: CreativeWork
equivalent class: LearningResource

License
type: Class
comment: Credential awarded by a government agency or other authorized organization that constitutes legal authority to do a specific job and/or utilize a specific item, system or infrastructure and are typically earned through some combination of degree or certificate attainment, certifications, assessments, work experience, and/or fees, and are time-limited and must be renewed periodically.
term status: stable
subclass of: Credential

Master Trade Certificate
type: Class
comment: Credential awarded at the Master level for demonstration of the highest level of skills and performance in industry trades and professions.
term status: stable
subclass of: Work-Based Learning Certificate

Master's Degree
type: Class
comment: Credential awarded for a graduate level course of study where course work and activities advance skills beyond those of the bachelor's degree or its equivalent.
description: Equivalent to an award at UNESCO ISCED 2011, Level 7, and United States IPEDS Award Level 7.
term status: stable
subclass of: Degree
equivalent class: Q183816

Master of Arts Degree
type: Class
comment: Credential awarded for a graduate level course of study where course work and activities advance skills beyond those of the bachelor's degree or its equivalent, with an emphasis in the liberal arts and sciences such as the humanities and social science fields.
description: Equivalent to an award at UNESCO ISCED 2011, Level 7, and United States IPEDS Award Level 7.
usage note: Use the name property to capture local variations on what this class covers.
term status: unstable
subclass of: Master's Degree

Master of Science Degree
type: Class
comment: Credential awarded for a graduate level course of study where course work and activities advance skills beyond those of the bachelor's degree or its equivalent, with an emphasis in scientific and technical fields and professional fields of study.
description: Equivalent to an award at UNESCO ISCED 2011, Level 7, and United States IPEDS Award Level 7.
usage note: Use the name property to capture local variations on what this class covers.
term status: unstable
subclass of: Master's Degree

Micro-Credential
type: Class
comment: Credential that addresses a subset of field-specific knowledge, skills, or competencies; often developmental with relationships to other micro-credentials and field credentials.
term status: stable
subclass of: Credential

Multi Component
type: Class
comment: Resource that is a proxy for multiple entities.
usage note: Completion or satisfaction of this Component entails completion or satisfaction of all entities for which this Component is a proxy, unless otherwise indicated by Constraints or other relevant information.
term status: unstable

Occupation
type: Class
comment: Profession, trade, or career field that may involve training and/or a formal qualification.
term status: stable

Occupation Classification
type: Class
comment: Class of concept schemes identifying occupations such as the Standard Occupational Classification (SOC) system in the U.S. and the European Skills/Competences, Qualifications and Occupations (ESCO).
term status: stable
subclass of: Credential Framework

Offer Action
type: Class
comment: Action by an authoritative agent offering access to a entity such as a credential, learning opportunity or assessment.
description: Since an instance of ceterms:CredentialingAction is a claim that a certain agent has taken the action being described, creation of such a ceterms:CredentialingAction should be reserved to the agent of that action.
term status: stable
subclass of: Credentialing Action

Open Badge
type: Class
comment: Visual symbol containing verifiable claims in accordance with the Open Badges specification and delivered digitally.
term status: stable
subclass of: Badge

Organization
type: Class
comment: An entity such as an association, company, corporation, club, co-operative, labor union etc.
usage note: Use for organizations that are not a Credential Organization or a QACredential Organization.
term status: stable
subclass of: Agent
equivalent class: Organization

Pathway
type: Class
comment: Resource composed of a structured set of PathwayComponents defining points along a route to fulfillment of a goal or objective.
term status: stable

Pathway Component
type: Class
comment: Resource that serves as a defined point along the route of a Pathway which describes an objective and its completion requirements through reference to one or more instances of ComponentCondition.
description: An instance of PathwayComponent may serve as the goal or destination node of a Pathway.
usage note: PathwayComponent is a super-type that represents a family of more precise sub-types. In pathway descriptions, always use the sub-type of PathwayComponent appropriate to your circumstances, e.g., AssessmentComponent, CocurricularComponent, CompetencyComponent, CourseComponent, CredentialComponent, ExtracurricularComponent, JobComponent, and WorkExperienceComponent. Use BasicComponent for types of entities not covered by the current set of sub-types.
term status: stable

Pathway Set
type: Class
comment: A roadmap of multiple related pathways that lead to one or more destinations.
term status: stable
subclass of: Collection

Place
type: Class
comment: Entity describing a physical location or geospatial area.
term status: stable
equivalent class: Place

Postal Address
type: Class
comment: Entity describing a mailing address.
term status: stable
subclass of: Contact Point
equivalent class: PostalAddress

Post-Baccalaureate Certificate
type: Class
comment: Credential award that requires completion of an organized program of study at a level beyond that of a bachelor's degree, which is designed for persons who have completed a baccalaureate degree but does not meet the requirements of a master's degree.
description: This may include certificates that are for specialties within an occupational field or occupational program of study. Equivalent to a United States IPEDS Award Level 6 and UNESCO ISCED 2011 Level 7.
term status: unstable
subclass of: Academic Certificate

Post-Master Certificate
type: Class
comment: Credential award that requires completion of an organized program of study beyond that of a master's degree, which is designed for persons who have completed a master's degree but does not meet the requirements of a doctor's degree.
description: This may include certificates that are for specialties within an occupational field or occupational program of study and can include post-doctoral first professional certificates such as healthcare and law. Equivalent to a United States IPEDS Award Level 7 or 17, 18, and 19, and UNESCO ISCED 2011 Level 8.
term status: unstable
subclass of: Academic Certificate

Pre-Apprenticeship Certificate
type: Class
comment: Credential awarded to indicate readiness for an apprentice-level program.
term status: unstable
subclass of: Work-Based Learning Certificate

Prior Learning Policy
type: Class
comment: Authoritative statement of rules, principles, or procedures adopted by an organization to govern decisions and actions within the scope of prior learning.
term status: unstable

Process Profile
type: Class
comment: Entity describing the type, nature, and other relevant information about a process.
term status: stable
subclass of: CreativeWork

Professional Certificate
type: Class
comment: Credential awarded for demonstrating competencies in a profession or particular occupational field, including job readiness.
description: These certificates validate competency in tasks, tools, software, or procedures within a particular industry and are often awarded by training centers, career and technical education, industry organizations, or businesses.
term status: unstable
subclass of: Certificate

Professional Doctorate
type: Class
comment: Doctoral degree conferred upon completion of a program providing the knowledge and skills for the recognition, credential, or license required for professional practice.
description: Equivalent to UNESCO ISCED, Level 8 and United States IPEDS Award Level 18.
usage note: Use the name property to capture local variations on what this class covers.
term status: stable
subclass of: Doctoral Degree
equivalent class: Q15978610

Proficiency Certificate
type: Class
comment: Credential awarded after assessment of skills in a specific area defined by a recognized body of experts, without regard for how the skills were learned.
description: Examples of specific areas include language, typing, music, and dance.
term status: unstable
subclass of: Certificate

QA Credential Organization
type: Class
comment: Quality assurance organization that plays one or more key roles in the lifecycle of a credential, learning program, or assessment.
usage note: For organizations that are not a QA Credential Organization or a Credential Organization, use ceterms:Organization.
term status: stable
subclass of: Organization

Qualifications Framework
type: Class
comment: Instrument for developing, classifying and issuing qualifications at international, national, regional or sectoral levels according to a set of criteria (such as descriptors) applicable to specified levels of learning outcomes.
term status: unstable

Quality Assurance Credential
type: Class
comment: Credential assuring that an organization, program, or awarded credential meets prescribed requirements and may include development and administration of qualifying examinations.
term status: stable
subclass of: Credential

Recognize Action
type: Class
comment: Action by an independent, neutral, and authoritative agent acknowledging the validity of a resource.
description: Since an instance of ceterms:CredentialingAction is a claim that a certain agent has taken the action being described, creation of such a ceterms:CredentialingAction should be reserved to the agent of that action.
term status: stable
subclass of: Credentialing Action

Registration Action
type: Class
comment: Action by an independent, neutral, and authoritative agent that registers a resource that has been vetted, approved, and validated to meet specific criteria.
term status: unstable
subclass of: Credentialing Action

Regulate Action
type: Class
comment: Action by an independent, neutral, and authoritative agent enforcing the legal requirements of a resource.
description: Since an instance of ceterms:CredentialingAction is a claim that a certain agent has taken the action being described, creation of such a ceterms:CredentialingAction should be reserved to the agent of that action.
term status: unstable
subclass of: Credentialing Action

Renew Action
type: Class
comment: Action by an agent renewing an existing credential assertion.
description: Since an instance of ceterms:CredentialingAction is a claim that a certain agent has taken the action being described, creation of such a ceterms:CredentialingAction should be reserved to the agent of that action.
term status: stable
subclass of: Credentialing Action

Research Doctorate
type: Class
comment: Doctoral degree conferred for advanced work beyond the master level, including the preparation and defense of a thesis or dissertation based on original research, or the planning and execution of an original project demonstrating substantial artistic or scholarly achievement.
description: Equivalent to UNESCO ISCED, Level 8 and United States IPEDS Award Level 17.
usage note: Use the name property to capture local variations on what this class covers.
term status: stable
subclass of: Doctoral Degree

Revocation Profile
type: Class
comment: Entity describing conditions and methods by which a credential can be removed from a holder.
term status: stable
subclass of: CreativeWork

Revoke Action
type: Class
comment: Action by an agent removing an awarded credential (credential assertion) from the credential holder based on violations or failure of the holder to renew.
description: Since an instance of ceterms:CredentialingAction is a claim that a certain agent has taken the action being described, creation of such a ceterms:CredentialingAction should be reserved to the agent of that action.
term status: stable
subclass of: Credentialing Action

Rights Action
type: Class
comment: Action asserting legal rights by an agent to possess, defend, transfer, license, and grant conditional access to a credential, learning opportunity, or assessment.
description: Since an instance of ceterms:CredentialingAction is a claim that a certain agent has taken the action being described, creation of such a ceterms:CredentialingAction should be reserved to the agent of that action.
term status: stable
subclass of: Credentialing Action

Scheduled Offering
type: Class
comment: Offering of a Learning Opportunity or Assessment with a schedule associated with a specified location or modality.
description: Provides data specific to a given scheduled offering; the Learning Opportunity (including Course and Learning Program) or Assessment being offered provides all data that is shared between different offerings.
usage note: Rather than repeating data, only use this class if the data differs from the data provided by the resource for which this is an offer.
term status: unstable

Secondary Education Certificate
type: Class
comment: Credential for successful completion of a formal secondary-level education program that is less than a diploma and does not indicate completion of secondary education graduation requirements.
usage note: Use Diploma or General Education Development to indicate completion of secondary education graduation requirements.
term status: unstable
subclass of: Academic Certificate

Secondary School Diploma
type: Class
comment: Diploma awarded by secondary education institutions for successful completion of a secondary school program of study.
description: Equivalent to an award at UNESCO ISCED 2011 Levels 2 or 3.
term status: stable
subclass of: Diploma
equivalent class: Q1312529

Specialist Degree
type: Class
comment: Credential awarded for a graduate level course of study where course work and activities advance skills beyond those of the master’s degree and less than a doctoral degree and provide specific preparation for advanced careers in a specialist field.
description: Equivalent to UNESCO ISCED, Level 8, and United States IPEDS Award Level 8.
usage note: Use the name property to capture local variations on what this class covers.
term status: unstable
subclass of: Degree

Structured Statement
type: Class
comment: A statement provided verbatim or by reference, with additional context such as type, source, or citation.
usage note: Do not use a StructureStatement if a property such as ceterms:description is adequate. When using ceterms:StructuredStatement use ceterms:statementText for the text in a document. Use ceterms:description and ceterms:subjectWebpage when a link is needed to the text in a document. The link should be directly to the relevant section of the document.
term status: unstable

Support Service
type: Class
comment: Resources and assistance that help people overcome barriers to succeed in their education and career goals.
description: Support services can be provided at any stage of an individual's education or career, and may be targeted towards people with or without direct affiliation with an organization. The goal of support services is to provide people with the assistance they need to achieve their full potential. Examples of Support Services include career advice, job placement, childcare, transportation, tools, mentorship, counseling, and other forms of aid.
term status: unstable

Task
type: Class
comment: Specific activity, typically related to performing a function or achieving a goal.
term status: stable

Technical Level 1 Certificate
type: Class
comment: Credential award at a postsecondary level for successful completion of a formal education program that is more than one semester and less than 1 year, demonstrating competencies within a specific subject area or an occupational area indicating job readiness.
description: Can lead to a Technical Certificate Level 2 or a degree. Equivalent to a United States IPEDS Award Level 1b that specifies postsecondary certificates of 300-899 clock hours, or 9-29 semester or trimester credit hours, or 13-44 quarter credit hours and UNESCO ISCED 2011 Level 4.
term status: unstable
subclass of: Academic Certificate

Technical Level 2 Certificate
type: Class
comment: Credential award at a postsecondary level for successful completion of a formal education program that is at least 1 year but less than 2 years, demonstrating competencies within a specific subject area or in an occupational area indicating job readiness.
description: Can lead to a degree. Equivalent to a United States IPEDS Award Level 2 that specifies postsecondary certificates of at least 900 but less than 1,800 clock hours, or at least 30 but less than 60 semester or trimester credit hours, or at least 45 but less than 90 quarter credit hours and UNESCO ISCED 2011 Level 4.
term status: unstable
subclass of: Academic Certificate

Technical Level 3 Certificate
type: Class
comment: Credential award at a postsecondary level for successful completion of a formal education program that is at least 2 years but less than 4 years, demonstrating competencies within specific occupational areas indicating job readiness.
description: Can lead to a degree. Equivalent to a United States IPEDS Award Level 4 that specifies certificates of 1,800 or more clock hours, or 60 or more semester or trimester credit hours, or 90 or more quarter credit hours and UNESCO ISCED 2011 Level 5.
term status: unstable
subclass of: Academic Certificate

Transfer Agreement
type: Class
comment: Formal agreement between two or more parties that specifies how prior learning is recognized, including its transfer and applicability for credit.
description: May include articulation agreements, memoranda of understanding, or similar arrangements that govern how learning achievements are recognized across organizations or other boundaries.
term status: unstable

Transfer Intermediary
type: Class
comment: Surrogate resource to which other resources are mapped in order to indicate their common transferability.
usage note: Used when multiple resources such as courses are grouped together to indicate they have mutually agreed upon transfer value.
term status: unstable

Transfer Value Profile
type: Class
comment: Description of transfer value of a resource.
term status: stable

Value Profile
type: Class
comment: A description of value awarded for, required by, or otherwise related to the resource.
term status: stable
subclass of: Quantitative Value

Verification Service Profile
type: Class
comment: Entity describing the means by which someone can verify whether a credential has been attained.
description: Includes, but is not limited to, verification of whether quality assurance credentials have been issued for organizations, learning opportunities, and assessments.
term status: stable
subclass of: Intangible

Work-Based Learning Certificate
type: Class
comment: Credential awarded for work-based learning and earn-and-learn models that meet standards and are applicable to industry, trades, occupations, and professions.
description: Work-based learning includes many types of skills training that are occupation specific including, but not limited to apprenticeships.
term status: unstable
subclass of: Certificate

Work Experience Component
type: Class
comment: Resource describing an activity or training through which a person gains job experience.
description: Instances act as proxies or stand-ins for other resources in the context of a particular pathway so that relationships between them as components of that pathway can be stated without implying that the those relationships are true of the resources in other contexts.
term status: stable
subclass of: Pathway Component

Workforce Demand Action
type: Class
comment: Action taken by an agent asserting that the resource being described has a workforce demand level worthy of note.
term status: unstable
subclass of: Credentialing Action

Work Role
type: Class
comment: Collection of tasks and competencies that embody a particular function in one or more jobs.
term status: stable

Quantitative Value
type: Class
comment: A point value or interval for product characteristics and other purposes.
usage note: Use in CTDL to describe quantitative values such as minimum and maximum credits or credit hours, etc.
term status: stable

Ability Embodied
type: Property
comment: Enduring attributes of the individual that influence performance are embodied either directly or indirectly in this resource.
usage note: The abilityEmbodied property may referenced a defined ability in an ontology such as O*NET or an existing competency defined in a competency framework.
term status: stable
domain includes: Competency
domain includes: Job
domain includes: Occupation
domain includes: Task
domain includes: Work Role
range includes: Competency

Comment
type: Property
comment: Supplemental text provided by the promulgating body that clarifies the nature, scope or use of this resource.
description: Use this property when the text provides useful context for this resource.
term status: stable
domain includes: Competency
domain includes: Industry
domain includes: Job
domain includes: Occupation
domain includes: Task
domain includes: Work Role
domain includes: Observation
range includes: langString
equivalent property: comment
equivalent property: notes

Has Child
type: Property
comment: The referenced resource is lower in some arbitrary hierarchy than this resource.
description: This property identifies a child node in the downward path in the chain of resources in a taxon path.
term status: stable
sub property of: relation
domain includes: Competency
domain includes: Assessment Component
domain includes: Basic Component
domain includes: Cocurricular Component
domain includes: Collection Component
domain includes: Competency Component
domain includes: Course Component
domain includes: Credential Component
domain includes: Extracurricular Component
domain includes: Job Component
domain includes: Multi Component
domain includes: Task
domain includes: Work Experience Component
range includes: Competency
range includes: Assessment Component
range includes: Basic Component
range includes: Cocurricular Component
range includes: Collection Component
range includes: Competency Component
range includes: Course Component
range includes: Credential Component
range includes: Extracurricular Component
range includes: Job Component
range includes: Multi Component
range includes: Task
range includes: Work Experience Component
equivalent property: hasChild
inverse of: Is Child Of

Is Child Of
type: Property
comment: The referenced resource is higher in some arbitrary hierarchy than this resource.
term status: stable
sub property of: relation
domain includes: Competency
domain includes: Assessment Component
domain includes: Basic Component
domain includes: Cocurricular Component
domain includes: Collection Component
domain includes: Competency Component
domain includes: Course Component
domain includes: Credential Component
domain includes: Extracurricular Component
domain includes: Job Component
domain includes: Multi Component
domain includes: Task
domain includes: Work Experience Component
range includes: Competency
range includes: Assessment Component
range includes: Basic Component
range includes: Cocurricular Component
range includes: Collection Component
range includes: Competency Component
range includes: Course Component
range includes: Credential Component
range includes: Extracurricular Component
range includes: Job Component
range includes: Multi Component
range includes: Pathway
range includes: Task
range includes: Work Experience Component
equivalent property: isChildOf
inverse of: Has Child

Knowledge Embodied
type: Property
comment: Body of information embodied either directly or indirectly in this resource.
term status: stable
domain includes: Competency
domain includes: Job
domain includes: Occupation
domain includes: Task
domain includes: Work Role
range includes: Competency

List ID
type: Property
comment: An alphanumeric string indicating the relative position of a resource in an ordered list of resources.
description: Examples of such strings include: such as "A", "B", or "a", "b", or "I", "II", or "1", "2".
usage note: Punctuation accompanying alphanumeric strings should not be included.
term status: stable
sub property of: listID
domain includes: Competency
domain includes: CriterionLevel
domain includes: RubricCriterion
domain includes: RubricLevel
domain includes: Structured Statement
domain includes: Task
range includes: string
equivalent property: listEnumeration

Skill Embodied
type: Property
comment: Ability to apply knowledge and use know-how to complete tasks and solve problems including types or categories of developed proficiency or dexterity in mental operations and physical processes is embodied either directly or indirectly in this resource.
usage note: The skillEmbodied property may reference a defined skill in an ontology such as O*NET or an existing competency defined in a competency framework.
term status: stable
domain includes: Competency
domain includes: Job
domain includes: Occupation
domain includes: Task
domain includes: Work Role
range includes: Competency
equivalent property: skillEmbodied

Accommodation Type
type: Property
comment: Type of modification to facilitate equal access for people to a physical location, resource, or service.
term status: unstable
domain includes: Support Service
range includes: Credential Alignment Object

Accredited By
type: Property
comment: Quality assurance organization that provides official authorization to, or approval of, a credential, organization, assessment, or learning opportunity.
term status: stable
domain includes: Academic Certificate
domain includes: Apprentice Certificate
domain includes: Assessment Profile
domain includes: Associate Degree
domain includes: Associate of Applied Arts Degree
domain includes: Associate of Applied Science Degree
domain includes: Associate of Arts Degree
domain includes: Associate of Science Degree
domain includes: Bachelor's Degree
domain includes: Bachelor of Arts Degree
domain includes: Bachelor of Science Degree
domain includes: Badge
domain includes: Basic Technical Certificate
domain includes: Certificate
domain includes: Certificate of Completion
domain includes: Certificate of Participation
domain includes: Certification
domain includes: Course
domain includes: Credential
domain includes: Credential Organization
domain includes: Degree
domain includes: Digital Badge
domain includes: Diploma
domain includes: Doctoral Degree
domain includes: General Education Development (GED)
domain includes: General Education Level 1 Certificate
domain includes: General Education Level 2 Certificate
domain includes: Higher Education Level 1 Certificate
domain includes: Higher Education Level 2 Certificate
domain includes: Journeyman Certificate
domain includes: Learning Opportunity Profile
domain includes: Learning Program
domain includes: License
domain includes: Master Trade Certificate
domain includes: Master's Degree
domain includes: Master of Arts Degree
domain includes: Master of Science Degree
domain includes: Micro-Credential
domain includes: Open Badge
domain includes: Organization
domain includes: Post-Baccalaureate Certificate
domain includes: Post-Master Certificate
domain includes: Pre-Apprenticeship Certificate
domain includes: Professional Certificate
domain includes: Professional Doctorate
domain includes: Proficiency Certificate
domain includes: QA Credential Organization
domain includes: Quality Assurance Credential
domain includes: Research Doctorate
domain includes: Secondary Education Certificate
domain includes: Secondary School Diploma
domain includes: Specialist Degree
domain includes: Technical Level 1 Certificate
domain includes: Technical Level 2 Certificate
domain includes: Technical Level 3 Certificate
domain includes: Work-Based Learning Certificate
range includes: Organization
range includes: QA Credential Organization

Accredited In
type: Property
comment: Region or political jurisdiction such as a state, province or locale in which the credential, learning opportunity or assessment is accredited.
term status: stable
domain includes: Academic Certificate
domain includes: Apprentice Certificate
domain includes: Assessment Profile
domain includes: Associate Degree
domain includes: Associate of Applied Arts Degree
domain includes: Associate of Applied Science Degree
domain includes: Associate of Arts Degree
domain includes: Associate of Science Degree
domain includes: Bachelor's Degree
domain includes: Bachelor of Arts Degree
domain includes: Bachelor of Science Degree
domain includes: Badge
domain includes: Basic Technical Certificate
domain includes: Certificate
domain includes: Certificate of Completion
domain includes: Certificate of Participation
domain includes: Certification
domain includes: Course
domain includes: Credential
domain includes: Credential Organization
domain includes: Degree
domain includes: Digital Badge
domain includes: Diploma
domain includes: Doctoral Degree
domain includes: General Education Development (GED)
domain includes: General Education Level 1 Certificate
domain includes: General Education Level 2 Certificate
domain includes: Higher Education Level 1 Certificate
domain includes: Higher Education Level 2 Certificate
domain includes: Journeyman Certificate
domain includes: Learning Opportunity Profile
domain includes: Learning Program
domain includes: License
domain includes: Master Trade Certificate
domain includes: Master's Degree
domain includes: Master of Arts Degree
domain includes: Master of Science Degree
domain includes: Micro-Credential
domain includes: Open Badge
domain includes: Organization
domain includes: Post-Baccalaureate Certificate
domain includes: Post-Master Certificate
domain includes: Pre-Apprenticeship Certificate
domain includes: Professional Certificate
domain includes: Professional Doctorate
domain includes: Proficiency Certificate
domain includes: QA Credential Organization
domain includes: Quality Assurance Credential
domain includes: Research Doctorate
domain includes: Secondary Education Certificate
domain includes: Secondary School Diploma
domain includes: Specialist Degree
domain includes: Technical Level 1 Certificate
domain includes: Technical Level 2 Certificate
domain includes: Technical Level 3 Certificate
domain includes: Work-Based Learning Certificate
range includes: Jurisdiction Profile

Accredits
type: Property
comment: Credential, assessment, organization, or learning opportunity for which this organization provides official authorization or approval based on prescribed standards or criteria.
usage note: Accredits includes the ongoing monitoring to confirm continued conformance to standards to maintain accreditation.
term status: stable
domain includes: Organization
domain includes: QA Credential Organization
range includes: CompetencyFramework
range includes: Academic Certificate
range includes: Apprentice Certificate
range includes: Assessment Profile
range includes: Associate Degree
range includes: Associate of Applied Arts Degree
range includes: Associate of Applied Science Degree
range includes: Associate of Arts Degree
range includes: Associate of Science Degree
range includes: Bachelor's Degree
range includes: Bachelor of Arts Degree
range includes: Bachelor of Science Degree
range includes: Badge
range includes: Basic Technical Certificate
range includes: Certificate
range includes: Certificate of Completion
range includes: Certificate of Participation
range includes: Certification
range includes: Course
range includes: Credential
range includes: Credential Organization
range includes: Degree
range includes: Digital Badge
range includes: Diploma
range includes: Doctoral Degree
range includes: General Education Development (GED)
range includes: General Education Level 1 Certificate
range includes: General Education Level 2 Certificate
range includes: Higher Education Level 1 Certificate
range includes: Higher Education Level 2 Certificate
range includes: Journeyman Certificate
range includes: Learning Opportunity Profile
range includes: Learning Program
range includes: License
range includes: Master Trade Certificate
range includes: Master's Degree
range includes: Master of Arts Degree
range includes: Master of Science Degree
range includes: Micro-Credential
range includes: Open Badge
range includes: Organization
range includes: Post-Baccalaureate Certificate
range includes: Post-Master Certificate
range includes: Pre-Apprenticeship Certificate
range includes: Professional Certificate
range includes: Professional Doctorate
range includes: Proficiency Certificate
range includes: QA Credential Organization
range includes: Quality Assurance Credential
range includes: Research Doctorate
range includes: Secondary Education Certificate
range includes: Secondary School Diploma
range includes: Specialist Degree
range includes: Technical Level 1 Certificate
range includes: Technical Level 2 Certificate
range includes: Technical Level 3 Certificate
range includes: Work-Based Learning Certificate

Acting Agent
type: Property
comment: Organization or person performing an action.
term status: stable
domain includes: Accredit Action
domain includes: Advanced Standing Action
domain includes: Approve Action
domain includes: Credentialing Action
domain includes: Offer Action
domain includes: Recognize Action
domain includes: Registration Action
domain includes: Regulate Action
domain includes: Renew Action
domain includes: Revoke Action
domain includes: Rights Action
domain includes: Workforce Demand Action
range includes: Credential Organization
range includes: Organization
range includes: QA Credential Organization
equivalent property: agent

Action Status Type
type: Property
comment: Entity describing the current disposition or standing of an action; select from an existing enumeration of such types.
term status: stable
sub property of: credentialAlignment
domain includes: Accredit Action
domain includes: Advanced Standing Action
domain includes: Approve Action
domain includes: Credentialing Action
domain includes: Offer Action
domain includes: Recognize Action
domain includes: Registration Action
domain includes: Regulate Action
domain includes: Renew Action
domain includes: Revoke Action
domain includes: Rights Action
domain includes: Workforce Demand Action
range includes: Credential Alignment Object
equivalent property: actionStatusType

Address
type: Property
comment: Particulars describing the location of the place.
term status: stable
domain includes: Credential Organization
domain includes: Organization
domain includes: QA Credential Organization
range includes: Place
equivalent property: address

Address Country
type: Property
comment: Nation with its own government and occupying a particular territory identified by the two-letter ISO 3166-1 alpha-2 country code.
term status: stable
domain includes: Place
domain includes: Postal Address
range includes: langString
equivalent property: addressCountry

Address Locality
type: Property
comment: Town, city, or village in which a particular location is situtated.
term status: stable
domain includes: Place
domain includes: Postal Address
range includes: langString
equivalent property: addressLocality

Address Region
type: Property
comment: State or province in which a particular location is situated.
term status: stable
domain includes: Place
domain includes: Postal Address
range includes: langString
equivalent property: addressRegion

Administration Process
type: Property
comment: Description of a process by which a resource is administered.
description: Processes described include the execution of events and the development of resources in the lifecycle of a credential or organization, such as the process for the proctoring of assessments.
usage note: For assessments and rubrics, this can be used to indicate the scoring algorithm.
term status: stable
domain includes: Rubric
domain includes: Academic Certificate
domain includes: Accredit Action
domain includes: Advanced Standing Action
domain includes: Apprentice Certificate
domain includes: Approve Action
domain includes: Assessment Profile
domain includes: Associate Degree
domain includes: Associate of Applied Arts Degree
domain includes: Associate of Applied Science Degree
domain includes: Associate of Arts Degree
domain includes: Associate of Science Degree
domain includes: Bachelor's Degree
domain includes: Bachelor of Arts Degree
domain includes: Bachelor of Science Degree
domain includes: Badge
domain includes: Basic Technical Certificate
domain includes: Certificate
domain includes: Certificate of Completion
domain includes: Certificate of Participation
domain includes: Certification
domain includes: Credential
domain includes: Credentialing Action
domain includes: Credential Organization
domain includes: Credential Type
domain includes: Degree
domain includes: Digital Badge
domain includes: Diploma
domain includes: Doctoral Degree
domain includes: General Education Development (GED)
domain includes: General Education Level 1 Certificate
domain includes: General Education Level 2 Certificate
domain includes: Higher Education Level 1 Certificate
domain includes: Higher Education Level 2 Certificate
domain includes: Journeyman Certificate
domain includes: License
domain includes: Master Trade Certificate
domain includes: Master's Degree
domain includes: Master of Arts Degree
domain includes: Master of Science Degree
domain includes: Micro-Credential
domain includes: Offer Action
domain includes: Open Badge
domain includes: Organization
domain includes: Post-Baccalaureate Certificate
domain includes: Post-Master Certificate
domain includes: Pre-Apprenticeship Certificate
domain includes: Professional Certificate
domain includes: Professional Doctorate
domain includes: Proficiency Certificate
domain includes: QA Credential Organization
domain includes: Qualifications Framework
domain includes: Quality Assurance Credential
domain includes: Recognize Action
domain includes: Registration Action
domain includes: Regulate Action
domain includes: Renew Action
domain includes: Research Doctorate
domain includes: Revoke Action
domain includes: Rights Action
domain includes: Secondary Education Certificate
domain includes: Secondary School Diploma
domain includes: Specialist Degree
domain includes: Support Service
domain includes: Technical Level 1 Certificate
domain includes: Technical Level 2 Certificate
domain includes: Technical Level 3 Certificate
domain includes: Transfer Value Profile
domain includes: Verification Service Profile
domain includes: Work-Based Learning Certificate
domain includes: Workforce Demand Action
domain includes: DataSetProfile
range includes: Process Profile

Advanced Standing From
type: Property
comment: Resource that has its time or cost reduced by another resource.
term status: stable
domain includes: Academic Certificate
domain includes: Apprentice Certificate
domain includes: Assessment Profile
domain includes: Associate Degree
domain includes: Associate of Applied Arts Degree
domain includes: Associate of Applied Science Degree
domain includes: Associate of Arts Degree
domain includes: Associate of Science Degree
domain includes: Bachelor's Degree
domain includes: Bachelor of Arts Degree
domain includes: Bachelor of Science Degree
domain includes: Badge
domain includes: Basic Technical Certificate
domain includes: Certificate
domain includes: Certificate of Completion
domain includes: Certificate of Participation
domain includes: Certification
domain includes: Course
domain includes: Credential
domain includes: Degree
domain includes: Digital Badge
domain includes: Diploma
domain includes: Doctoral Degree
domain includes: General Education Development (GED)
domain includes: General Education Level 1 Certificate
domain includes: General Education Level 2 Certificate
domain includes: Higher Education Level 1 Certificate
domain includes: Higher Education Level 2 Certificate
domain includes: Journeyman Certificate
domain includes: Learning Opportunity Profile
domain includes: Learning Program
domain includes: License
domain includes: Master Trade Certificate
domain includes: Master's Degree
domain includes: Master of Arts Degree
domain includes: Master of Science Degree
domain includes: Micro-Credential
domain includes: Open Badge
domain includes: Post-Baccalaureate Certificate
domain includes: Post-Master Certificate
domain includes: Pre-Apprenticeship Certificate
domain includes: Professional Certificate
domain includes: Professional Doctorate
domain includes: Proficiency Certificate
domain includes: Quality Assurance Credential
domain includes: Research Doctorate
domain includes: Secondary Education Certificate
domain includes: Secondary School Diploma
domain includes: Specialist Degree
domain includes: Technical Level 1 Certificate
domain includes: Technical Level 2 Certificate
domain includes: Technical Level 3 Certificate
domain includes: Work-Based Learning Certificate
range includes: Academic Certificate
range includes: Apprentice Certificate
range includes: Assessment Profile
range includes: Associate Degree
range includes: Associate of Applied Arts Degree
range includes: Associate of Applied Science Degree
range includes: Associate of Arts Degree
range includes: Associate of Science Degree
range includes: Bachelor's Degree
range includes: Bachelor of Arts Degree
range includes: Bachelor of Science Degree
range includes: Badge
range includes: Basic Technical Certificate
range includes: Certificate
range includes: Certificate of Completion
range includes: Certificate of Participation
range includes: Certification
range includes: Condition Profile
range includes: Course
range includes: Credential
range includes: Degree
range includes: Digital Badge
range includes: Diploma

Affiliated Agent
type: Property
comment: Organization or person that plays some role in assigning, performing, assisting with, facilitating, approving of, or otherwise being involved with the task being described.
term status: stable
range includes: Credential Organization
range includes: Organization
range includes: QA Credential Organization

Affiliation
type: Property
comment: Organization to which a person is formally related through work, sudy, or social engagement.
term status: stable
sub property of: affiliation
domain includes: Condition Profile
domain includes: CredentialPerson
range includes: Credential Organization
range includes: Organization
range includes: QA Credential Organization

Agent Purpose
type: Property
comment: Organization's primary purpose as found on an "about" page of a website.
term status: stable
domain includes: Credential Organization
domain includes: Organization
domain includes: QA Credential Organization
range includes: anyURI

Agent Purpose Description
type: Property
comment: Short, key phrases describing the primary purpose of an organization as might be derived from the "about" page of it's website.
term status: stable
domain includes: Credential Organization
domain includes: Organization
domain includes: QA Credential Organization
range includes: langString

Agent Sector Type
type: Property
comment: Type of sociological, economic, or political subdivision served by an organization; select from an existing enumeration of such types.
usage note: Recommended best practice for credentials in the Credential Engine Registry is to use concepts from the ceterms:AgentSector vocabulary.
term status: stable
sub property of: credentialAlignment
domain includes: Credential Organization
domain includes: Organization
domain includes: QA Credential Organization
range includes: Credential Alignment Object

Agent Type
type: Property
comment: Type of organization such as educational institution, credentialing organization or quality assurance body; select from an existing enumeration of such types.
usage note: Best practice for developing credential descriptions for the Credential Engine Registry is to use the ceterms:OrganizationType vocabulary.
term status: stable
domain includes: Credential Organization
domain includes: Organization
domain includes: QA Credential Organization
range includes: Credential Alignment Object

Aggregate Data
type: Property
comment: Statistical information about the resource.
term status: stable
domain includes: Academic Certificate
domain includes: Apprentice Certificate
domain includes: Assessment Profile
domain includes: Associate Degree
domain includes: Associate of Applied Arts Degree
domain includes: Associate of Applied Science Degree
domain includes: Associate of Arts Degree
domain includes: Associate of Science Degree
domain includes: Bachelor's Degree
domain includes: Bachelor of Arts Degree
domain includes: Bachelor of Science Degree
domain includes: Badge
domain includes: Basic Technical Certificate
domain includes: Certificate
domain includes: Certificate of Completion
domain includes: Certificate of Participation
domain includes: Certification
domain includes: Credential
domain includes: Degree
domain includes: Digital Badge
domain includes: Diploma
domain includes: Doctoral Degree
domain includes: General Education Development (GED)
domain includes: General Education Level 1 Certificate
domain includes: General Education Level 2 Certificate
domain includes: Higher Education Level 1 Certificate
domain includes: Higher Education Level 2 Certificate
domain includes: Journeyman Certificate
domain includes: Learning Opportunity Profile
domain includes: License
domain includes: Master Trade Certificate
domain includes: Master's Degree
domain includes: Master of Arts Degree
domain includes: Master of Science Degree
domain includes: Micro-Credential
domain includes: Open Badge
domain includes: Post-Baccalaureate Certificate
domain includes: Post-Master Certificate
domain includes: Pre-Apprenticeship Certificate
domain includes: Professional Certificate
domain includes: Professional Doctorate
domain includes: Proficiency Certificate
domain includes: Quality Assurance Credential
domain includes: Research Doctorate
domain includes: Scheduled Offering
domain includes: Secondary Education Certificate
domain includes: Secondary School Diploma
domain includes: Specialist Degree
domain includes: Technical Level 1 Certificate
domain includes: Technical Level 2 Certificate
domain includes: Technical Level 3 Certificate
domain includes: Work-Based Learning Certificate
range includes: Aggregate Data Profile

Agreement Type
type: Property
comment: Type or nature of the document that is being described.
usage note: Best practice is to draw from an existing concept scheme such as ceterms:DocumentCategory, which may be supplemented by more precise terms from a locally defined concept scheme if required.
term status: unstable
domain includes: Transfer Agreement
range includes: Concept

Alignment Date
type: Property
comment: The date the alignment was made.
term status: stable
sub property of: Temporal Coverage
domain includes: Alignment Object
domain includes: Credential Alignment Object
domain includes: FinancialAlignmentObject
range includes: date

Alignment Type
type: Property
comment: Type of relationship between two entities.
usage note: This property is necessary only for AlignmentObjects as part of an AlignmentMap where it is the property that expresses the alignment from the source node (as subject) and target node (as object). When the CredentialAlignmentObject is used, the type value is definitively identified by the property that points to it and so in this case the alignmentType property is redundant.
term status: stable
domain includes: Alignment Object
domain includes: Credential Alignment Object
domain includes: FinancialAlignmentObject
range includes: Concept
equivalent property: alignmentType

Alternate Name
type: Property
comment: Alias for the entity including acronyms, alpha-numeric notations, and other forms of name abbreviations in common use.
term status: stable
domain includes: Academic Certificate
domain includes: Aggregate Data Profile
domain includes: Alignment Map
domain includes: Apprentice Certificate
domain includes: Assessment Component
domain includes: Assessment Profile
domain includes: Associate Degree
domain includes: Associate of Applied Arts Degree
domain includes: Associate of Applied Science Degree
domain includes: Associate of Arts Degree
domain includes: Associate of Science Degree
domain includes: Bachelor's Degree
domain includes: Bachelor of Arts Degree
domain includes: Bachelor of Science Degree
domain includes: Badge
domain includes: Basic Component
domain includes: Basic Technical Certificate
domain includes: Certificate
domain includes: Certificate of Completion
domain includes: Certificate of Participation
domain includes: Certification
domain includes: Cocurricular Component
domain includes: Collection
domain includes: Collection Component
domain includes: Collection Member
domain includes: Competency Component
domain includes: Component Condition
domain includes: Condition Manifest
domain includes: Condition Profile
domain includes: Constraint
domain includes: Contact Point
domain includes: Cost Manifest
domain includes: Cost Profile
domain includes: Course
domain includes: Course Component
domain includes: Credential
domain includes: Credential Component
domain includes: Credential Organization
domain includes: Credential Type
domain includes: Degree
domain includes: Digital Badge
domain includes: Diploma
domain includes: Doctoral Degree
domain includes: Earnings Profile
domain includes: Employment Outcome Profile
domain includes: Extracurricular Component
domain includes: Financial Assistance Profile
domain includes: General Education Development (GED)
domain includes: General Education Level 1 Certificate
domain includes: General Education Level 2 Certificate
domain includes: Geographic Coordinates
domain includes: Higher Education Level 1 Certificate
domain includes: Higher Education Level 2 Certificate
domain includes: Holders Profile
domain includes: Industry
domain includes: Job
domain includes: Job Component
domain includes: Journeyman Certificate
domain includes: Learning Opportunity Profile
domain includes: Learning Program
domain includes: License
domain includes: Master Trade Certificate
domain includes: Master's Degree
domain includes: Master of Arts Degree
domain includes: Master of Science Degree
domain includes: Micro-Credential
domain includes: Multi Component
domain includes: Occupation
domain includes: Open Badge
domain includes: Organization
domain includes: Pathway
domain includes: Pathway Set
domain includes: Place
domain includes: Postal Address
domain includes: Post-Baccalaureate Certificate
domain includes: Post-Master Certificate

Alternative Condition
type: Property
comment: Constraints, prerequisites, entry conditions, or requirements in a context where more than one alternative condition or path has been defined and from which any one path fulfills the parent condition.
description: A set of alternative conditions are not necessarily mutually exclusive paths; for example, a set of alternative concentrations for a degree may allow a person to optionally complete more than one concentration even though only one is required to earn the degree.
term status: stable
domain includes: Condition Profile
range includes: Condition Profile

Appeal Process
type: Property
comment: Description of a formal process for objecting to decisions of an organization.
term status: stable
domain includes: Academic Certificate
domain includes: Apprentice Certificate
domain includes: Associate Degree
domain includes: Associate of Applied Arts Degree
domain includes: Associate of Applied Science Degree
domain includes: Associate of Arts Degree
domain includes: Associate of Science Degree
domain includes: Bachelor's Degree
domain includes: Bachelor of Arts Degree
domain includes: Bachelor of Science Degree
domain includes: Badge
domain includes: Basic Technical Certificate
domain includes: Certificate
domain includes: Certificate of Completion
domain includes: Certificate of Participation
domain includes: Certification
domain includes: Credential
domain includes: Credential Organization
domain includes: Degree
domain includes: Digital Badge
domain includes: Diploma
domain includes: Doctoral Degree
domain includes: General Education Development (GED)
domain includes: General Education Level 1 Certificate
domain includes: General Education Level 2 Certificate
domain includes: Higher Education Level 1 Certificate
domain includes: Higher Education Level 2 Certificate
domain includes: Journeyman Certificate
domain includes: License
domain includes: Master Trade Certificate
domain includes: Master's Degree
domain includes: Master of Arts Degree
domain includes: Master of Science Degree
domain includes: Micro-Credential
domain includes: Open Badge
domain includes: Organization
domain includes: Post-Baccalaureate Certificate
domain includes: Post-Master Certificate
domain includes: Pre-Apprenticeship Certificate
domain includes: Professional Certificate
domain includes: Professional Doctorate
domain includes: Proficiency Certificate
domain includes: QA Credential Organization
domain includes: Quality Assurance Credential
domain includes: Research Doctorate
domain includes: Secondary Education Certificate
domain includes: Secondary School Diploma
domain includes: Specialist Degree
domain includes: Technical Level 1 Certificate
domain includes: Technical Level 2 Certificate
domain includes: Technical Level 3 Certificate
domain includes: Transfer Intermediary
domain includes: Transfer Value Profile
domain includes: Work-Based Learning Certificate
range includes: Process Profile

Applicability
type: Property
comment: Receiving curriculum or requirement context to which the transfer value is applied.
usage note: If the types of applicability are formally defined as an enumeration published with URIs, > then the relevant URI can be entered as the targetNode of the Credential Alignment Object; if they are informally defined or not published then use the targetNodeName and targetNodeDescription of the Credential Alignment Object to define the relevant type.
term status: unstable
domain includes: Transfer Value Profile
range includes: Credential Alignment Object

Approved By
type: Property
comment: Agent that pronounces favorable judgment for this resource.
term status: stable
domain includes: Academic Certificate
domain includes: Alignment Map
domain includes: Apprentice Certificate
domain includes: Assessment Profile
domain includes: Associate Degree
domain includes: Associate of Applied Arts Degree
domain includes: Associate of Applied Science Degree
domain includes: Associate of Arts Degree
domain includes: Associate of Science Degree
domain includes: Bachelor's Degree
domain includes: Bachelor of Arts Degree
domain includes: Bachelor of Science Degree
domain includes: Badge
domain includes: Basic Technical Certificate
domain includes: Certificate
domain includes: Certificate of Completion
domain includes: Certificate of Participation
domain includes: Certification
domain includes: Course
domain includes: Credential
domain includes: Credential Organization
domain includes: Credential Type
domain includes: Degree
domain includes: Digital Badge
domain includes: Diploma
domain includes: Doctoral Degree
domain includes: General Education Development (GED)
domain includes: General Education Level 1 Certificate
domain includes: General Education Level 2 Certificate
domain includes: Higher Education Level 1 Certificate
domain includes: Higher Education Level 2 Certificate
domain includes: Journeyman Certificate
domain includes: Learning Opportunity Profile
domain includes: Learning Program
domain includes: License
domain includes: Master Trade Certificate
domain includes: Master's Degree
domain includes: Master of Arts Degree
domain includes: Master of Science Degree
domain includes: Micro-Credential
domain includes: Open Badge
domain includes: Organization
domain includes: Post-Baccalaureate Certificate
domain includes: Post-Master Certificate
domain includes: Pre-Apprenticeship Certificate
domain includes: Professional Certificate
domain includes: Professional Doctorate
domain includes: Proficiency Certificate
domain includes: QA Credential Organization
domain includes: Qualifications Framework
domain includes: Quality Assurance Credential
domain includes: Research Doctorate
domain includes: Secondary Education Certificate
domain includes: Secondary School Diploma
domain includes: Specialist Degree
domain includes: Technical Level 1 Certificate
domain includes: Technical Level 2 Certificate
domain includes: Technical Level 3 Certificate
domain includes: Transfer Agreement
domain includes: Work-Based Learning Certificate
range includes: Credential Organization
range includes: Organization
range includes: QA Credential Organization

Approved In
type: Property
comment: Region or political jurisdiction such as a state, province or locale in which an organization pronounces favorable judgment for this resource.
term status: stable
domain includes: Academic Certificate
domain includes: Alignment Map
domain includes: Apprentice Certificate
domain includes: Assessment Profile
domain includes: Associate Degree
domain includes: Associate of Applied Arts Degree
domain includes: Associate of Applied Science Degree
domain includes: Associate of Arts Degree
domain includes: Associate of Science Degree
domain includes: Bachelor's Degree
domain includes: Bachelor of Arts Degree
domain includes: Bachelor of Science Degree
domain includes: Badge
domain includes: Basic Technical Certificate
domain includes: Certificate
domain includes: Certificate of Completion
domain includes: Certificate of Participation
domain includes: Certification
domain includes: Course
domain includes: Credential
domain includes: Credential Organization
domain includes: Credential Type
domain includes: Degree
domain includes: Digital Badge
domain includes: Diploma
domain includes: Doctoral Degree
domain includes: General Education Development (GED)
domain includes: General Education Level 1 Certificate
domain includes: General Education Level 2 Certificate
domain includes: Higher Education Level 1 Certificate
domain includes: Higher Education Level 2 Certificate
domain includes: Journeyman Certificate
domain includes: Learning Opportunity Profile
domain includes: Learning Program
domain includes: License
domain includes: Master Trade Certificate
domain includes: Master's Degree
domain includes: Master of Arts Degree
domain includes: Master of Science Degree
domain includes: Micro-Credential
domain includes: Open Badge
domain includes: Organization
domain includes: Post-Baccalaureate Certificate
domain includes: Post-Master Certificate
domain includes: Pre-Apprenticeship Certificate
domain includes: Professional Certificate
domain includes: Professional Doctorate
domain includes: Proficiency Certificate
domain includes: QA Credential Organization
domain includes: Qualifications Framework
domain includes: Quality Assurance Credential
domain includes: Research Doctorate
domain includes: Secondary Education Certificate
domain includes: Secondary School Diploma
domain includes: Specialist Degree
domain includes: Technical Level 1 Certificate
domain includes: Technical Level 2 Certificate
domain includes: Technical Level 3 Certificate
domain includes: Transfer Agreement
domain includes: Work-Based Learning Certificate
range includes: Jurisdiction Profile

Approves
type: Property
comment: Credential, assessment, learning opportunity, or organization for which this organization pronounces favorable judgment.
term status: stable
domain includes: Credential Organization
domain includes: Organization
domain includes: QA Credential Organization
range includes: CompetencyFramework
range includes: Academic Certificate
range includes: Apprentice Certificate
range includes: Assessment Profile
range includes: Associate Degree
range includes: Associate of Applied Arts Degree
range includes: Associate of Applied Science Degree
range includes: Associate of Arts Degree
range includes: Associate of Science Degree
range includes: Bachelor's Degree
range includes: Bachelor of Arts Degree
range includes: Bachelor of Science Degree
range includes: Badge
range includes: Basic Technical Certificate
range includes: Certificate
range includes: Certificate of Completion
range includes: Certificate of Participation
range includes: Certification
range includes: Course
range includes: Credential
range includes: Credential Organization
range includes: CredentialPerson
range includes: Degree
range includes: Digital Badge
range includes: Diploma
range includes: Doctoral Degree
range includes: General Education Development (GED)
range includes: General Education Level 1 Certificate
range includes: General Education Level 2 Certificate
range includes: Higher Education Level 1 Certificate
range includes: Higher Education Level 2 Certificate
range includes: Journeyman Certificate
range includes: Learning Opportunity Profile
range includes: Learning Program
range includes: License
range includes: Master Trade Certificate
range includes: Master's Degree
range includes: Master of Arts Degree
range includes: Master of Science Degree
range includes: Micro-Credential
range includes: Open Badge
range includes: Organization
range includes: Post-Baccalaureate Certificate
range includes: Post-Master Certificate
range includes: Pre-Apprenticeship Certificate
range includes: Professional Certificate
range includes: Professional Doctorate
range includes: Proficiency Certificate
range includes: QA Credential Organization
range includes: Quality Assurance Credential
range includes: Research Doctorate
range includes: Secondary Education Certificate
range includes: Secondary School Diploma
range includes: Specialist Degree
range includes: Technical Level 1 Certificate
range includes: Technical Level 2 Certificate
range includes: Technical Level 3 Certificate
range includes: Work-Based Learning Certificate

Asserted By
type: Property
comment: Agent making a statement based on fact or belief.
term status: stable
domain includes: Condition Profile
domain includes: Industry
domain includes: Jurisdiction Profile
domain includes: Occupation
domain includes: Task
domain includes: Work Role
range includes: Credential Organization
range includes: Organization
range includes: QA Credential Organization

Assesses
type: Property
comment: Competency evaluated through the assessment.
term status: stable
sub property of: Target Competency
domain includes: Assessment Profile
domain includes: Course
domain includes: Learning Opportunity Profile
domain includes: Learning Program
range includes: Competency
range includes: Credential Alignment Object

Assessment Delivery Type
type: Property
comment: Delivery type for the assessment for the credential.
description: Indicates the delivery type for the assessment for the credential.
term status: stable
sub property of: Delivery Type
domain includes: Academic Certificate
domain includes: Apprentice Certificate
domain includes: Associate Degree
domain includes: Associate of Applied Arts Degree
domain includes: Associate of Applied Science Degree
domain includes: Associate of Arts Degree
domain includes: Associate of Science Degree
domain includes: Bachelor's Degree
domain includes: Bachelor of Arts Degree
domain includes: Bachelor of Science Degree
domain includes: Badge
domain includes: Basic Technical Certificate
domain includes: Certificate
domain includes: Certificate of Completion
domain includes: Certificate of Participation
domain includes: Certification
domain includes: Credential
domain includes: Degree
domain includes: Digital Badge
domain includes: Diploma
domain includes: Doctoral Degree
domain includes: General Education Development (GED)
domain includes: General Education Level 1 Certificate
domain includes: General Education Level 2 Certificate
domain includes: Higher Education Level 1 Certificate
domain includes: Higher Education Level 2 Certificate
domain includes: Journeyman Certificate
domain includes: License
domain includes: Master Trade Certificate
domain includes: Master's Degree
domain includes: Master of Arts Degree
domain includes: Master of Science Degree
domain includes: Micro-Credential
domain includes: Open Badge
domain includes: Post-Baccalaureate Certificate
domain includes: Post-Master Certificate
domain includes: Pre-Apprenticeship Certificate
domain includes: Professional Certificate
domain includes: Professional Doctorate
domain includes: Proficiency Certificate
domain includes: Quality Assurance Credential
domain includes: Research Doctorate
domain includes: Secondary Education Certificate
domain includes: Secondary School Diploma
domain includes: Specialist Degree
domain includes: Technical Level 1 Certificate
domain includes: Technical Level 2 Certificate
domain includes: Technical Level 3 Certificate
domain includes: Work-Based Learning Certificate
range includes: Credential Alignment Object

Assessment Example
type: Property
comment: Example assessment or assessment item.
term status: stable
domain includes: Assessment Profile
range includes: anyURI

Assessment Example Description
type: Property
comment: Text of an example assessment or assessment item.
term status: stable
domain includes: Assessment Profile
range includes: langString

Assessment Method Description
type: Property
comment: Description of the methods used to conduct assessment.
term status: stable
domain includes: Assessment Profile
domain includes: Course
domain includes: Learning Opportunity Profile
domain includes: Learning Program
range includes: langString

Assessment Method Type
type: Property
comment: Type of method used to conduct an assessment; select from an existing enumeration of such types.
usage note: Best practice for developing credential descriptions for the Credential Engine Registry is to use the ceterms:AssessmentMethod vocabulary.
term status: stable
domain includes: Assessment Profile
domain includes: Course
domain includes: Learning Opportunity Profile
domain includes: Learning Program
range includes: Credential Alignment Object

Assessment Output
type: Property
comment: Description of the assessment artifact, performance or examination.
term status: stable
domain includes: Assessment Profile
range includes: langString

Assessment Use Type
type: Property
comment: Type of intended use of the assessment; select from an existing enumeration of such types.
usage note: Best practice for developing credential descriptions for the Credential Engine Registry is to use the ceterms:AssessmentUse vocabulary.
term status: stable
domain includes: Assessment Profile
range includes: Credential Alignment Object

At Level
type: Property
comment: Indicates the stage or level of achievement in a progression of learning.
usage note: Indicates the level an audience will hold upon completion or attainment. To indicate the level of the audience that should be qualified to pursue this resource, use audienceLevel.
term status: unstable
domain includes: Academic Certificate
domain includes: Apprentice Certificate
domain includes: Assessment Profile
domain includes: Associate Degree
domain includes: Associate of Applied Arts Degree
domain includes: Associate of Applied Science Degree
domain includes: Associate of Arts Degree
domain includes: Associate of Science Degree
domain includes: Bachelor's Degree
domain includes: Bachelor of Arts Degree
domain includes: Bachelor of Science Degree
domain includes: Badge
domain includes: Basic Technical Certificate
domain includes: Certificate
domain includes: Certificate of Completion
domain includes: Certificate of Participation
domain includes: Certification
domain includes: Course
domain includes: Credential
domain includes: Credential Type
domain includes: Degree
domain includes: Digital Badge
domain includes: Diploma
domain includes: Doctoral Degree
domain includes: General Education Development (GED)
domain includes: General Education Level 1 Certificate
domain includes: General Education Level 2 Certificate
domain includes: Higher Education Level 1 Certificate
domain includes: Higher Education Level 2 Certificate
domain includes: Job
domain includes: Journeyman Certificate
domain includes: Learning Opportunity Profile
domain includes: Learning Program
domain includes: License
domain includes: Master Trade Certificate
domain includes: Master's Degree
domain includes: Master of Arts Degree
domain includes: Master of Science Degree
domain includes: Micro-Credential
domain includes: Occupation
domain includes: Open Badge
domain includes: Post-Baccalaureate Certificate
domain includes: Post-Master Certificate
domain includes: Pre-Apprenticeship Certificate
domain includes: Professional Certificate
domain includes: Professional Doctorate
domain includes: Proficiency Certificate
domain includes: Quality Assurance Credential
domain includes: Research Doctorate
domain includes: Secondary Education Certificate
domain includes: Secondary School Diploma
domain includes: Specialist Degree
domain includes: Technical Level 1 Certificate
domain includes: Technical Level 2 Certificate
domain includes: Technical Level 3 Certificate
domain includes: Work-Based Learning Certificate
domain includes: Work Role
range includes: Credential Alignment Object

Audience Level Type
type: Property
comment: Type of level indicating a point in a progression through an educational or training context, for which the resource is intended; select from an existing enumeration of such types.
usage note: Best practice is to use terms from the CTDL Audience Level vocabulary.
term status: stable
sub property of: credentialAlignment
domain includes: Rubric
domain includes: Academic Certificate
domain includes: Apprentice Certificate
domain includes: Assessment Profile
domain includes: Associate Degree
domain includes: Associate of Applied Arts Degree
domain includes: Associate of Applied Science Degree
domain includes: Associate of Arts Degree
domain includes: Associate of Science Degree
domain includes: Bachelor's Degree
domain includes: Bachelor of Arts Degree
domain includes: Bachelor of Science Degree
domain includes: Badge
domain includes: Basic Technical Certificate
domain includes: Certificate
domain includes: Certificate of Completion
domain includes: Certificate of Participation
domain includes: Certification
domain includes: Condition Profile
domain includes: Course
domain includes: Credential
domain includes: Credential Type
domain includes: Degree
domain includes: Digital Badge
domain includes: Diploma
domain includes: Doctoral Degree
domain includes: General Education Development (GED)
domain includes: General Education Level 1 Certificate
domain includes: General Education Level 2 Certificate
domain includes: Higher Education Level 1 Certificate
domain includes: Higher Education Level 2 Certificate
domain includes: Journeyman Certificate
domain includes: Learning Opportunity Profile
domain includes: Learning Program
domain includes: License
domain includes: Master Trade Certificate
domain includes: Master's Degree
domain includes: Master of Arts Degree
domain includes: Master of Science Degree
domain includes: Micro-Credential
domain includes: Open Badge
domain includes: Post-Baccalaureate Certificate
domain includes: Post-Master Certificate
domain includes: Pre-Apprenticeship Certificate
domain includes: Professional Certificate
domain includes: Professional Doctorate
domain includes: Proficiency Certificate
domain includes: Quality Assurance Credential
domain includes: Research Doctorate
domain includes: Secondary Education Certificate
domain includes: Secondary School Diploma
domain includes: Specialist Degree
domain includes: Technical Level 1 Certificate
domain includes: Technical Level 2 Certificate
domain includes: Technical Level 3 Certificate
domain includes: Work-Based Learning Certificate
range includes: Credential Alignment Object
equivalent property: educationLevel

Audience Type
type: Property
comment: The type of audience for which the resource is applicable, intended, or useful; select from an existing enumeration of such types.
usage note: Best practice for developing credential descriptions for the Credential Engine Registry is to use the ceterms:Audience vocabulary.
term status: stable
sub property of: credentialAlignment
domain includes: Rubric
domain includes: Academic Certificate
domain includes: Apprentice Certificate
domain includes: Assessment Profile
domain includes: Associate Degree
domain includes: Associate of Applied Arts Degree
domain includes: Associate of Applied Science Degree
domain includes: Associate of Arts Degree
domain includes: Associate of Science Degree
domain includes: Bachelor's Degree
domain includes: Bachelor of Arts Degree
domain includes: Bachelor of Science Degree
domain includes: Badge
domain includes: Basic Technical Certificate
domain includes: Certificate
domain includes: Certificate of Completion
domain includes: Certificate of Participation
domain includes: Certification
domain includes: Condition Profile
domain includes: Cost Profile
domain includes: Course
domain includes: Credential
domain includes: Degree
domain includes: Digital Badge
domain includes: Diploma
domain includes: Doctoral Degree
domain includes: General Education Development (GED)
domain includes: General Education Level 1 Certificate
domain includes: General Education Level 2 Certificate
domain includes: Higher Education Level 1 Certificate
domain includes: Higher Education Level 2 Certificate
domain includes: Journeyman Certificate
domain includes: Learning Opportunity Profile
domain includes: Learning Program
domain includes: License
domain includes: Master Trade Certificate
domain includes: Master's Degree
domain includes: Master of Arts Degree
domain includes: Master of Science Degree
domain includes: Micro-Credential
domain includes: Open Badge
domain includes: Post-Baccalaureate Certificate
domain includes: Post-Master Certificate
domain includes: Pre-Apprenticeship Certificate
domain includes: Prior Learning Policy
domain includes: Professional Certificate
domain includes: Professional Doctorate
domain includes: Proficiency Certificate
domain includes: Quality Assurance Credential
domain includes: Research Doctorate
domain includes: Secondary Education Certificate
domain includes: Secondary School Diploma
domain includes: Specialist Degree
domain includes: Technical Level 1 Certificate
domain includes: Technical Level 2 Certificate
domain includes: Technical Level 3 Certificate
domain includes: Transfer Agreement
domain includes: Work-Based Learning Certificate
range includes: Credential Alignment Object

Availability Listing
type: Property
comment: Listing of online and/or physical locations where a resource can be found or pursued.
term status: stable
domain includes: Academic Certificate
domain includes: Apprentice Certificate
domain includes: Assessment Profile
domain includes: Associate Degree
domain includes: Associate of Applied Arts Degree
domain includes: Associate of Applied Science Degree
domain includes: Associate of Arts Degree
domain includes: Associate of Science Degree
domain includes: Bachelor's Degree
domain includes: Bachelor of Arts Degree
domain includes: Bachelor of Science Degree
domain includes: Badge
domain includes: Basic Technical Certificate
domain includes: Certificate
domain includes: Certificate of Completion
domain includes: Certificate of Participation
domain includes: Certification
domain includes: Course
domain includes: Credential
domain includes: Credential Organization
domain includes: Degree
domain includes: Digital Badge
domain includes: Diploma
domain includes: Doctoral Degree
domain includes: General Education Development (GED)
domain includes: General Education Level 1 Certificate
domain includes: General Education Level 2 Certificate
domain includes: Higher Education Level 1 Certificate
domain includes: Higher Education Level 2 Certificate
domain includes: Journeyman Certificate
domain includes: Learning Opportunity Profile
domain includes: Learning Program
domain includes: License
domain includes: Master Trade Certificate
domain includes: Master's Degree
domain includes: Master of Arts Degree
domain includes: Master of Science Degree
domain includes: Micro-Credential
domain includes: Open Badge
domain includes: Organization
domain includes: Post-Baccalaureate Certificate
domain includes: Post-Master Certificate
domain includes: Pre-Apprenticeship Certificate
domain includes: Professional Certificate
domain includes: Professional Doctorate
domain includes: Proficiency Certificate
domain includes: QA Credential Organization
domain includes: Quality Assurance Credential
domain includes: Research Doctorate
domain includes: Scheduled Offering
domain includes: Secondary Education Certificate
domain includes: Secondary School Diploma
domain includes: Specialist Degree
domain includes: Support Service
domain includes: Technical Level 1 Certificate
domain includes: Technical Level 2 Certificate
domain includes: Technical Level 3 Certificate
domain includes: Work-Based Learning Certificate
range includes: anyURI

Available At
type: Property
comment: Physical location where the credential, assessment, or learning opportunity can be pursued.
term status: stable
sub property of: Spatial Coverage
domain includes: Academic Certificate
domain includes: Apprentice Certificate
domain includes: Assessment Profile
domain includes: Associate Degree
domain includes: Associate of Applied Arts Degree
domain includes: Associate of Applied Science Degree
domain includes: Associate of Arts Degree
domain includes: Associate of Science Degree
domain includes: Bachelor's Degree
domain includes: Bachelor of Arts Degree
domain includes: Bachelor of Science Degree
domain includes: Badge
domain includes: Basic Technical Certificate
domain includes: Certificate
domain includes: Certificate of Completion
domain includes: Certificate of Participation
domain includes: Certification
domain includes: Course
domain includes: Credential
domain includes: Degree
domain includes: Digital Badge
domain includes: Diploma
domain includes: Doctoral Degree
domain includes: General Education Development (GED)
domain includes: General Education Level 1 Certificate
domain includes: General Education Level 2 Certificate
domain includes: Higher Education Level 1 Certificate
domain includes: Higher Education Level 2 Certificate
domain includes: Journeyman Certificate
domain includes: Learning Opportunity Profile
domain includes: Learning Program
domain includes: License
domain includes: Master Trade Certificate
domain includes: Master's Degree
domain includes: Master of Arts Degree
domain includes: Master of Science Degree
domain includes: Micro-Credential
domain includes: Open Badge
domain includes: Post-Baccalaureate Certificate
domain includes: Post-Master Certificate
domain includes: Pre-Apprenticeship Certificate
domain includes: Professional Certificate
domain includes: Professional Doctorate
domain includes: Proficiency Certificate
domain includes: Quality Assurance Credential
domain includes: Research Doctorate
domain includes: Scheduled Offering
domain includes: Secondary Education Certificate
domain includes: Secondary School Diploma
domain includes: Specialist Degree
domain includes: Support Service
domain includes: Technical Level 1 Certificate
domain includes: Technical Level 2 Certificate
domain includes: Technical Level 3 Certificate
domain includes: Work-Based Learning Certificate
range includes: Place

Available Online At
type: Property
comment: Online location where the credential, assessment, or learning opportunity can be pursued.
term status: stable
domain includes: Academic Certificate
domain includes: Apprentice Certificate
domain includes: Assessment Profile
domain includes: Associate Degree
domain includes: Associate of Applied Arts Degree
domain includes: Associate of Applied Science Degree
domain includes: Associate of Arts Degree
domain includes: Associate of Science Degree
domain includes: Bachelor's Degree
domain includes: Bachelor of Arts Degree
domain includes: Bachelor of Science Degree
domain includes: Badge
domain includes: Basic Technical Certificate
domain includes: Certificate
domain includes: Certificate of Completion
domain includes: Certificate of Participation
domain includes: Certification
domain includes: Course
domain includes: Credential
domain includes: Degree
domain includes: Digital Badge
domain includes: Diploma
domain includes: Doctoral Degree
domain includes: General Education Development (GED)
domain includes: General Education Level 1 Certificate
domain includes: General Education Level 2 Certificate
domain includes: Higher Education Level 1 Certificate
domain includes: Higher Education Level 2 Certificate
domain includes: Journeyman Certificate
domain includes: Learning Opportunity Profile
domain includes: Learning Program
domain includes: License
domain includes: Master Trade Certificate
domain includes: Master's Degree
domain includes: Master of Arts Degree
domain includes: Master of Science Degree
domain includes: Micro-Credential
domain includes: Open Badge
domain includes: Post-Baccalaureate Certificate
domain includes: Post-Master Certificate
domain includes: Pre-Apprenticeship Certificate
domain includes: Professional Certificate
domain includes: Professional Doctorate
domain includes: Proficiency Certificate
domain includes: Quality Assurance Credential
domain includes: Research Doctorate
domain includes: Scheduled Offering
domain includes: Secondary Education Certificate
domain includes: Secondary School Diploma
domain includes: Specialist Degree
domain includes: Support Service
domain includes: Technical Level 1 Certificate
domain includes: Technical Level 2 Certificate
domain includes: Technical Level 3 Certificate
domain includes: Work-Based Learning Certificate
range includes: anyURI

Broad Alignment
type: Property
comment: Item that covers all of the relevant concepts in the item being described as well as additional relevant concepts.
term status: stable
sub property of: Is Similar To
domain includes: Academic Certificate
domain includes: Apprentice Certificate
domain includes: Associate Degree
domain includes: Associate of Applied Arts Degree
domain includes: Associate of Applied Science Degree
domain includes: Associate of Arts Degree
domain includes: Associate of Science Degree
domain includes: Bachelor's Degree
domain includes: Bachelor of Arts Degree
domain includes: Bachelor of Science Degree
domain includes: Badge
domain includes: Basic Technical Certificate
domain includes: Certificate
domain includes: Certificate of Completion
domain includes: Certificate of Participation
domain includes: Certification
domain includes: Credential
domain includes: Credential Type
domain includes: Degree
domain includes: Digital Badge
domain includes: Diploma
domain includes: Doctoral Degree
domain includes: General Education Development (GED)
domain includes: General Education Level 1 Certificate
domain includes: General Education Level 2 Certificate
domain includes: Higher Education Level 1 Certificate
domain includes: Higher Education Level 2 Certificate
domain includes: Journeyman Certificate
domain includes: License
domain includes: Master Trade Certificate
domain includes: Master's Degree
domain includes: Master of Arts Degree
domain includes: Master of Science Degree
domain includes: Micro-Credential
domain includes: Open Badge
domain includes: Post-Baccalaureate Certificate
domain includes: Post-Master Certificate
domain includes: Pre-Apprenticeship Certificate
domain includes: Professional Certificate
domain includes: Professional Doctorate
domain includes: Proficiency Certificate
domain includes: Quality Assurance Credential
domain includes: Research Doctorate
domain includes: Secondary Education Certificate
domain includes: Secondary School Diploma
domain includes: Specialist Degree
domain includes: Technical Level 1 Certificate
domain includes: Technical Level 2 Certificate
domain includes: Technical Level 3 Certificate
domain includes: Work-Based Learning Certificate
range includes: Academic Certificate
range includes: Apprentice Certificate
range includes: Associate Degree
range includes: Associate of Applied Arts Degree
range includes: Associate of Applied Science Degree
range includes: Associate of Arts Degree
range includes: Associate of Science Degree
range includes: Bachelor's Degree
range includes: Bachelor of Arts Degree
range includes: Bachelor of Science Degree
range includes: Badge
range includes: Basic Technical Certificate
range includes: Certificate
range includes: Certificate of Completion
range includes: Certificate of Participation
range includes: Certification
range includes: Credential
range includes: Credential Type
range includes: Degree
range includes: Digital Badge
range includes: Diploma
range includes: Doctoral Degree
range includes: General Education Development (GED)
range includes: General Education Level 1 Certificate
range includes: General Education Level 2 Certificate

Classification
type: Property
comment: Category or classification of this resource.
usage note: Where a more specific property exists, such as ceterms:naics, ceterms:isicV4, ceterms:credentialType, etc., use that property instead of this one.
term status: stable
domain includes: Competency
domain includes: Rubric
domain includes: Academic Certificate
domain includes: Alignment Map
domain includes: Apprentice Certificate
domain includes: Assessment Profile
domain includes: Associate Degree
domain includes: Associate of Applied Arts Degree
domain includes: Associate of Applied Science Degree
domain includes: Associate of Arts Degree
domain includes: Associate of Science Degree
domain includes: Bachelor's Degree
domain includes: Bachelor of Arts Degree
domain includes: Bachelor of Science Degree
domain includes: Badge
domain includes: Basic Technical Certificate
domain includes: Certificate
domain includes: Certificate of Completion
domain includes: Certificate of Participation
domain includes: Certification
domain includes: Collection
domain includes: Course
domain includes: Credential
domain includes: Credential Type
domain includes: Degree
domain includes: Digital Badge
domain includes: Diploma
domain includes: Doctoral Degree
domain includes: General Education Development (GED)
domain includes: General Education Level 1 Certificate
domain includes: General Education Level 2 Certificate
domain includes: Higher Education Level 1 Certificate
domain includes: Higher Education Level 2 Certificate
domain includes: Industry
domain includes: Job
domain includes: Journeyman Certificate
domain includes: Learning Opportunity Profile
domain includes: Learning Program
domain includes: License
domain includes: Master Trade Certificate
domain includes: Master's Degree
domain includes: Master of Arts Degree
domain includes: Master of Science Degree
domain includes: Micro-Credential
domain includes: Occupation
domain includes: Open Badge
domain includes: Post-Baccalaureate Certificate
domain includes: Post-Master Certificate
domain includes: Pre-Apprenticeship Certificate
domain includes: Prior Learning Policy
domain includes: Professional Certificate
domain includes: Professional Doctorate
domain includes: Proficiency Certificate
domain includes: Qualifications Framework
domain includes: Quality Assurance Credential
domain includes: Research Doctorate
domain includes: Secondary Education Certificate
domain includes: Secondary School Diploma
domain includes: Specialist Degree
domain includes: Task
domain includes: Technical Level 1 Certificate
domain includes: Technical Level 2 Certificate
domain includes: Technical Level 3 Certificate
domain includes: Transfer Agreement
domain includes: Work-Based Learning Certificate
domain includes: Work Role
domain includes: DataSetProfile
range includes: Concept

Coded Notation
type: Property
comment: Set of alpha-numeric symbols as defined by the body responsible for this resource that uniquely identifies this resource and supports its discovery and use.
description: Examples include course codes (e.g., "ENG101"), US Standard Occupation Codes (e.g., "31-9091"), North American Industry Classification System codes (e.g., "236117"), or any other bespoke code used by the provider of the resource to identify it.
usage note: For identifiers that come from a recognized identification scheme use the specific property for that identifier type, such as ceterms:opeID, ceterms:ncesID, ceterms:leiCode, etc., or use ceterms:identifier so that the identification schema can be named.
term status: stable
domain includes: Alignment Map
domain includes: Collection
domain includes: Course
domain includes: Credential Alignment Object
domain includes: Industry
domain includes: Job
domain includes: Learning Opportunity Profile
domain includes: Learning Program
domain includes: Occupation
domain includes: Prior Learning Policy
domain includes: Qualifications Framework
domain includes: Structured Statement
domain includes: Task
domain includes: Transfer Agreement
domain includes: Transfer Intermediary
domain includes: Work Role
range includes: string

Collection Type
type: Property
comment: Type of collection, list, array, or other grouping of resources; select from an existing enumeration of such types.
term status: unstable
domain includes: Collection
range includes: Credential Alignment Object

Common Conditions
type: Property
comment: Set constraints, prerequisites, entry conditions, or requirements that are shared across an organization, organizational subdivision, set of credentials, or category of entities and activities.
term status: stable
domain includes: Academic Certificate
domain includes: Apprentice Certificate
domain includes: Assessment Profile
domain includes: Associate Degree
domain includes: Associate of Applied Arts Degree
domain includes: Associate of Applied Science Degree
domain includes: Associate of Arts Degree
domain includes: Associate of Science Degree
domain includes: Bachelor's Degree
domain includes: Bachelor of Arts Degree
domain includes: Bachelor of Science Degree
domain includes: Badge
domain includes: Basic Technical Certificate
domain includes: Certificate
domain includes: Certificate of Completion
domain includes: Certificate of Participation
domain includes: Certification
domain includes: Course
domain includes: Credential
domain includes: Credential Type
domain includes: Degree
domain includes: Digital Badge
domain includes: Diploma
domain includes: Doctoral Degree
domain includes: General Education Development (GED)
domain includes: General Education Level 1 Certificate
domain includes: General Education Level 2 Certificate
domain includes: Higher Education Level 1 Certificate
domain includes: Higher Education Level 2 Certificate
domain includes: Journeyman Certificate
domain includes: Learning Opportunity Profile
domain includes: Learning Program
domain includes: License
domain includes: Master Trade Certificate
domain includes: Master's Degree
domain includes: Master of Arts Degree
domain includes: Master of Science Degree
domain includes: Micro-Credential
domain includes: Open Badge
domain includes: Post-Baccalaureate Certificate
domain includes: Post-Master Certificate
domain includes: Pre-Apprenticeship Certificate
domain includes: Professional Certificate
domain includes: Professional Doctorate
domain includes: Proficiency Certificate
domain includes: Quality Assurance Credential
domain includes: Research Doctorate
domain includes: Secondary Education Certificate
domain includes: Secondary School Diploma
domain includes: Specialist Degree
domain includes: Support Service
domain includes: Technical Level 1 Certificate
domain includes: Technical Level 2 Certificate
domain includes: Technical Level 3 Certificate
domain includes: Transfer Value Profile
domain includes: Work-Based Learning Certificate
range includes: Condition Manifest

Common Costs
type: Property
comment: Set of costs maintained at an organizational or sub-organizational level, which apply to this credential, assessment, or learning opportunity.
term status: stable
domain includes: Academic Certificate
domain includes: Apprentice Certificate
domain includes: Assessment Profile
domain includes: Associate Degree
domain includes: Associate of Applied Arts Degree
domain includes: Associate of Applied Science Degree
domain includes: Associate of Arts Degree
domain includes: Associate of Science Degree
domain includes: Bachelor's Degree
domain includes: Bachelor of Arts Degree
domain includes: Bachelor of Science Degree
domain includes: Badge
domain includes: Basic Technical Certificate
domain includes: Certificate
domain includes: Certificate of Completion
domain includes: Certificate of Participation
domain includes: Certification
domain includes: Condition Profile
domain includes: Course
domain includes: Credential
domain includes: Degree
domain includes: Digital Badge
domain includes: Diploma
domain includes: Doctoral Degree
domain includes: General Education Development (GED)
domain includes: General Education Level 1 Certificate
domain includes: General Education Level 2 Certificate
domain includes: Higher Education Level 1 Certificate
domain includes: Higher Education Level 2 Certificate
domain includes: Journeyman Certificate
domain includes: Learning Opportunity Profile
domain includes: Learning Program
domain includes: License
domain includes: Master Trade Certificate
domain includes: Master's Degree
domain includes: Master of Arts Degree
domain includes: Master of Science Degree
domain includes: Micro-Credential
domain includes: Open Badge
domain includes: Post-Baccalaureate Certificate
domain includes: Post-Master Certificate
domain includes: Pre-Apprenticeship Certificate
domain includes: Professional Certificate
domain includes: Professional Doctorate
domain includes: Proficiency Certificate
domain includes: Quality Assurance Credential
domain includes: Research Doctorate
domain includes: Scheduled Offering
domain includes: Secondary Education Certificate
domain includes: Secondary School Diploma
domain includes: Specialist Degree
domain includes: Support Service
domain includes: Technical Level 1 Certificate
domain includes: Technical Level 2 Certificate
domain includes: Technical Level 3 Certificate
domain includes: Work-Based Learning Certificate
range includes: Cost Manifest

Comparator
type: Property
comment: Type of symbol that denotes an operator in a constraint expression such as "GTEQ" (greater than or equal to), "EQ" (equal to), "LT" (less than); select from an existing enumeration of such types.
term status: unstable
domain includes: Constraint
range includes: Concept

Compares
type: Property
comment: Framework that contains terms that are compared in this AlignmentMap.
description: Frameworks may be Concept Schemes, Progression Models, and other educational frameworks.
term status: unstable
domain includes: Alignment Map
range includes: ProgressionModel
range includes: CompetencyFramework
range includes: ConceptScheme

Complaint Process
type: Property
comment: Description of a process for handling complaints about a resource or related resources.
term status: stable
domain includes: Academic Certificate
domain includes: Apprentice Certificate
domain includes: Assessment Profile
domain includes: Associate Degree
domain includes: Associate of Applied Arts Degree
domain includes: Associate of Applied Science Degree
domain includes: Associate of Arts Degree
domain includes: Associate of Science Degree
domain includes: Bachelor's Degree
domain includes: Bachelor of Arts Degree
domain includes: Bachelor of Science Degree
domain includes: Badge
domain includes: Basic Technical Certificate
domain includes: Certificate
domain includes: Certificate of Completion
domain includes: Certificate of Participation
domain includes: Certification
domain includes: Collection
domain includes: Course
domain includes: Credential
domain includes: Credential Organization
domain includes: Degree
domain includes: Digital Badge
domain includes: Diploma
domain includes: Doctoral Degree
domain includes: General Education Development (GED)
domain includes: General Education Level 1 Certificate
domain includes: General Education Level 2 Certificate
domain includes: Higher Education Level 1 Certificate
domain includes: Higher Education Level 2 Certificate
domain includes: Journeyman Certificate
domain includes: Learning Opportunity Profile
domain includes: Learning Program
domain includes: License
domain includes: Master Trade Certificate
domain includes: Master's Degree
domain includes: Master of Arts Degree
domain includes: Master of Science Degree
domain includes: Micro-Credential
domain includes: Open Badge
domain includes: Organization
domain includes: Post-Baccalaureate Certificate
domain includes: Post-Master Certificate
domain includes: Pre-Apprenticeship Certificate
domain includes: Prior Learning Policy
domain includes: Professional Certificate
domain includes: Professional Doctorate
domain includes: Proficiency Certificate
domain includes: QA Credential Organization
domain includes: Quality Assurance Credential
domain includes: Research Doctorate
domain includes: Secondary Education Certificate
domain includes: Secondary School Diploma
domain includes: Specialist Degree
domain includes: Support Service
domain includes: Technical Level 1 Certificate
domain includes: Technical Level 2 Certificate
domain includes: Technical Level 3 Certificate
domain includes: Transfer Agreement
domain includes: Transfer Intermediary
domain includes: Transfer Value Profile
domain includes: Work-Based Learning Certificate
range includes: Process Profile

Component Category
type: Property
comment: Identifies the type of PathwayComponent subclass not explicitly covered in the current array of PathwayComponent subclasses.
term status: stable
domain includes: Basic Component
domain includes: Cocurricular Component
domain includes: Extracurricular Component
range includes: langString

Component Designation
type: Property
comment: Label identifying the category to further distinguish one component from another as designated by the promulgating body.
description: Examples may include "Required", "Core", "General Education", "Elective", etc.
term status: stable
domain includes: Assessment Component
domain includes: Basic Component
domain includes: Cocurricular Component
domain includes: Collection Component
domain includes: Competency Component
domain includes: Course Component
domain includes: Credential Component
domain includes: Extracurricular Component
domain includes: Job Component
domain includes: Multi Component
domain includes: Work Experience Component
range includes: Credential Alignment Object

Condition
type: Property
comment: Single constraint, prerequisite, entry condition, requirement, or cost.
term status: stable
sub property of: Description
domain includes: Condition Profile
domain includes: Cost Profile
range includes: langString

Condition Excludes
type: Property
comment: Resource that does not count toward fulfilling a constraint, prerequisite, entry condition, or requirement.
description: Intended for cases where it is simplest to express exceptions to a general requirement, for example when a requirement is met by any Math course except "Access Math".
term status: unstable
domain includes: Condition Manifest
domain includes: Condition Profile
range includes: anyURI

Condition Manifest Of
type: Property
comment: Organization maintaining the condition manifest.
term status: stable
domain includes: Condition Manifest
range includes: Credential Organization
range includes: Organization
range includes: QA Credential Organization
inverse of: Has Condition Manifest

Contact Type
type: Property
comment: Text identifying the type of service provided by an organizational contact.
description: A person or organization may have different contact points for different services. The contact type property provides for adding text to identity the service; e.g., "toll-free number" or "support for hearing-impaired callers".
term status: stable
domain includes: Contact Point
range includes: langString

Co-Prerequisite
type: Property
comment: Resource that must be completed prior to, or pursued at the same time as, this resource.
term status: unstable
sub property of: Requires
domain includes: Academic Certificate
domain includes: Apprentice Certificate
domain includes: Assessment Profile
domain includes: Associate Degree
domain includes: Associate of Applied Arts Degree
domain includes: Associate of Applied Science Degree
domain includes: Associate of Arts Degree
domain includes: Associate of Science Degree
domain includes: Bachelor's Degree
domain includes: Bachelor of Arts Degree
domain includes: Bachelor of Science Degree
domain includes: Badge
domain includes: Basic Technical Certificate
domain includes: Certificate
domain includes: Certificate of Completion
domain includes: Certificate of Participation
domain includes: Certification
domain includes: Condition Manifest
domain includes: Course
domain includes: Credential
domain includes: Credential Type
domain includes: Degree
domain includes: Digital Badge
domain includes: Diploma
domain includes: Doctoral Degree
domain includes: General Education Development (GED)
domain includes: General Education Level 1 Certificate
domain includes: General Education Level 2 Certificate
domain includes: Higher Education Level 1 Certificate
domain includes: Higher Education Level 2 Certificate
domain includes: Journeyman Certificate
domain includes: Learning Opportunity Profile
domain includes: Learning Program
domain includes: License
domain includes: Master Trade Certificate
domain includes: Master's Degree
domain includes: Master of Arts Degree
domain includes: Master of Science Degree
domain includes: Micro-Credential
domain includes: Open Badge
domain includes: Post-Baccalaureate Certificate
domain includes: Post-Master Certificate
domain includes: Pre-Apprenticeship Certificate
domain includes: Professional Certificate
domain includes: Professional Doctorate
domain includes: Proficiency Certificate
domain includes: Quality Assurance Credential
domain includes: Research Doctorate
domain includes: Secondary Education Certificate
domain includes: Secondary School Diploma
domain includes: Specialist Degree
domain includes: Technical Level 1 Certificate
domain includes: Technical Level 2 Certificate
domain includes: Technical Level 3 Certificate
domain includes: Work-Based Learning Certificate
range includes: Condition Profile

Copyright Holder
type: Property
comment: Person or organization holding the rights in copyright to this resource.
term status: stable
domain includes: Academic Certificate
domain includes: Alignment Map
domain includes: Apprentice Certificate
domain includes: Associate Degree
domain includes: Associate of Applied Arts Degree
domain includes: Associate of Applied Science Degree
domain includes: Associate of Arts Degree
domain includes: Associate of Science Degree
domain includes: Bachelor's Degree
domain includes: Bachelor of Arts Degree
domain includes: Bachelor of Science Degree
domain includes: Badge
domain includes: Basic Technical Certificate
domain includes: Certificate
domain includes: Certificate of Completion
domain includes: Certificate of Participation
domain includes: Certification
domain includes: Credential
domain includes: Credential Type
domain includes: Degree
domain includes: Digital Badge
domain includes: Diploma
domain includes: Doctoral Degree
domain includes: General Education Development (GED)
domain includes: General Education Level 1 Certificate
domain includes: General Education Level 2 Certificate
domain includes: Higher Education Level 1 Certificate
domain includes: Higher Education Level 2 Certificate
domain includes: Journeyman Certificate
domain includes: License
domain includes: Master Trade Certificate
domain includes: Master's Degree
domain includes: Master of Arts Degree
domain includes: Master of Science Degree
domain includes: Micro-Credential
domain includes: Open Badge
domain includes: Post-Baccalaureate Certificate
domain includes: Post-Master Certificate
domain includes: Pre-Apprenticeship Certificate
domain includes: Prior Learning Policy
domain includes: Professional Certificate
domain includes: Professional Doctorate
domain includes: Proficiency Certificate
domain includes: Qualifications Framework
domain includes: Quality Assurance Credential
domain includes: Research Doctorate
domain includes: Secondary Education Certificate
domain includes: Secondary School Diploma
domain includes: Specialist Degree
domain includes: Technical Level 1 Certificate
domain includes: Technical Level 2 Certificate
domain includes: Technical Level 3 Certificate
domain includes: Transfer Agreement
domain includes: Work-Based Learning Certificate
range includes: Credential Organization
range includes: CredentialPerson
range includes: Organization
range includes: QA Credential Organization
equivalent property: copyrightHolder

Corequisite
type: Property
comment: Resources that must be pursued concurrently.
description: Includes dual (double) degrees that cannot be earned independently of each other.
term status: stable
sub property of: Requires
domain includes: Academic Certificate
domain includes: Apprentice Certificate
domain includes: Assessment Profile
domain includes: Associate Degree
domain includes: Associate of Applied Arts Degree
domain includes: Associate of Applied Science Degree
domain includes: Associate of Arts Degree
domain includes: Associate of Science Degree
domain includes: Bachelor's Degree
domain includes: Bachelor of Arts Degree
domain includes: Bachelor of Science Degree
domain includes: Badge
domain includes: Basic Technical Certificate
domain includes: Certificate
domain includes: Certificate of Completion
domain includes: Certificate of Participation
domain includes: Certification
domain includes: Condition Manifest
domain includes: Course
domain includes: Credential
domain includes: Credential Type
domain includes: Degree
domain includes: Digital Badge
domain includes: Diploma
domain includes: Doctoral Degree
domain includes: General Education Development (GED)
domain includes: General Education Level 1 Certificate
domain includes: General Education Level 2 Certificate
domain includes: Higher Education Level 1 Certificate
domain includes: Higher Education Level 2 Certificate
domain includes: Journeyman Certificate
domain includes: Learning Opportunity Profile
domain includes: Learning Program
domain includes: License
domain includes: Master Trade Certificate
domain includes: Master's Degree
domain includes: Master of Arts Degree
domain includes: Master of Science Degree
domain includes: Micro-Credential
domain includes: Open Badge
domain includes: Post-Baccalaureate Certificate
domain includes: Post-Master Certificate
domain includes: Pre-Apprenticeship Certificate
domain includes: Professional Certificate
domain includes: Professional Doctorate
domain includes: Proficiency Certificate
domain includes: Quality Assurance Credential
domain includes: Research Doctorate
domain includes: Secondary Education Certificate
domain includes: Secondary School Diploma
domain includes: Specialist Degree
domain includes: Technical Level 1 Certificate
domain includes: Technical Level 2 Certificate
domain includes: Technical Level 3 Certificate
domain includes: Work-Based Learning Certificate
range includes: Condition Profile

Cost Details
type: Property
comment: Webpage or online document containing human-readable, in-depth information about costs.
term status: stable
domain includes: Cost Manifest
domain includes: Cost Profile
range includes: anyURI

Cost Manifest Of
type: Property
comment: Organization maintaining the cost manifest.
term status: stable
domain includes: Cost Manifest
range includes: Credential Organization
range includes: Organization
range includes: QA Credential Organization
inverse of: Has Cost Manifest

Credential Identifier
type: Property
comment: Globally unique identifier by which the creator, owner or provider of a credential recognizes that credential in transactions with the external environment (e.g., in verifiable claims involving the credential).
description: The identifier may take the form of a URN, UUID, ARK, DOI, INFO or any other publicly recognized, globally unique identifier scheme.
usage note: Best practice for descriptions intended for the Credential Engine Registry is to use the ceterms:ctid property for this purpose; ceterms:ctid is declared as a subproperty of ceterms:credentialId.
term status: stable
domain includes: Academic Certificate
domain includes: Apprentice Certificate
domain includes: Associate Degree
domain includes: Associate of Applied Arts Degree
domain includes: Associate of Applied Science Degree
domain includes: Associate of Arts Degree
domain includes: Associate of Science Degree
domain includes: Bachelor's Degree
domain includes: Bachelor of Arts Degree
domain includes: Bachelor of Science Degree
domain includes: Badge
domain includes: Basic Technical Certificate
domain includes: Certificate
domain includes: Certificate of Completion
domain includes: Certificate of Participation
domain includes: Certification
domain includes: Credential
domain includes: Credential Type
domain includes: Degree
domain includes: Digital Badge
domain includes: Diploma
domain includes: Doctoral Degree
domain includes: General Education Development (GED)
domain includes: General Education Level 1 Certificate
domain includes: General Education Level 2 Certificate
domain includes: Higher Education Level 1 Certificate
domain includes: Higher Education Level 2 Certificate
domain includes: Journeyman Certificate
domain includes: License
domain includes: Master Trade Certificate
domain includes: Master's Degree
domain includes: Master of Arts Degree
domain includes: Master of Science Degree
domain includes: Micro-Credential
domain includes: Open Badge
domain includes: Post-Baccalaureate Certificate
domain includes: Post-Master Certificate
domain includes: Pre-Apprenticeship Certificate
domain includes: Professional Certificate
domain includes: Professional Doctorate
domain includes: Proficiency Certificate
domain includes: Quality Assurance Credential
domain includes: Research Doctorate
domain includes: Secondary Education Certificate
domain includes: Secondary School Diploma
domain includes: Specialist Degree
domain includes: Technical Level 1 Certificate
domain includes: Technical Level 2 Certificate
domain includes: Technical Level 3 Certificate
domain includes: Work-Based Learning Certificate
range includes: string

Credentialing Action
type: Property
comment: Indicates a past or potential credentialing action in which the resource being described plays an 'object' role.
term status: stable
domain includes: Credential Organization
domain includes: Organization
domain includes: QA Credential Organization
range includes: Accredit Action
range includes: Advanced Standing Action
range includes: Approve Action
range includes: Credentialing Action
range includes: Offer Action
range includes: Recognize Action
range includes: Registration Action
range includes: Regulate Action
range includes: Renew Action
range includes: Revoke Action
range includes: Rights Action

Credential Status Type
type: Property
comment: Type of official status of the credential; select from an enumeration of such types.
usage note: Best practice for developing credential descriptions for the Credential Engine Registry is to use the ceterms:CredentialStatus vocabulary.
term status: stable
sub property of: Life Cycle Status Type
domain includes: Academic Certificate
domain includes: Apprentice Certificate
domain includes: Associate Degree
domain includes: Associate of Applied Arts Degree
domain includes: Associate of Applied Science Degree
domain includes: Associate of Arts Degree
domain includes: Associate of Science Degree
domain includes: Bachelor's Degree
domain includes: Bachelor of Arts Degree
domain includes: Bachelor of Science Degree
domain includes: Badge
domain includes: Basic Technical Certificate
domain includes: Certificate
domain includes: Certificate of Completion
domain includes: Certificate of Participation
domain includes: Certification
domain includes: Credential
domain includes: Credential Type
domain includes: Degree
domain includes: Digital Badge
domain includes: Diploma
domain includes: Doctoral Degree
domain includes: General Education Development (GED)
domain includes: General Education Level 1 Certificate
domain includes: General Education Level 2 Certificate
domain includes: Higher Education Level 1 Certificate
domain includes: Higher Education Level 2 Certificate
domain includes: Journeyman Certificate
domain includes: License
domain includes: Master Trade Certificate
domain includes: Master's Degree
domain includes: Master of Arts Degree
domain includes: Master of Science Degree
domain includes: Micro-Credential
domain includes: Open Badge
domain includes: Post-Baccalaureate Certificate
domain includes: Post-Master Certificate
domain includes: Pre-Apprenticeship Certificate
domain includes: Professional Certificate
domain includes: Professional Doctorate
domain includes: Proficiency Certificate
domain includes: Quality Assurance Credential
domain includes: Research Doctorate
domain includes: Secondary Education Certificate
domain includes: Secondary School Diploma
domain includes: Specialist Degree
domain includes: Technical Level 1 Certificate
domain includes: Technical Level 2 Certificate
domain includes: Technical Level 3 Certificate
domain includes: Work-Based Learning Certificate
range includes: Credential Alignment Object

Credential Type
type: Property
comment: Indicates the specific type of credential or qualification of this resource.
usage note: Use to identify a more specific type than is provided using the rdf:type (JSON-LD "@type") property. For example, resources with type CredentialComponent may identify a specific subclass of ceterms:Credential; resources typed as a subclass of ceterms:Credential may identify a specific instance of ceterms:CredentialType.
term status: stable
domain includes: Academic Certificate
domain includes: Apprentice Certificate
domain includes: Associate Degree
domain includes: Associate of Applied Arts Degree
domain includes: Associate of Applied Science Degree
domain includes: Associate of Arts Degree
domain includes: Associate of Science Degree
domain includes: Bachelor's Degree
domain includes: Bachelor of Arts Degree
domain includes: Bachelor of Science Degree
domain includes: Badge
domain includes: Basic Technical Certificate
domain includes: Certificate
domain includes: Certificate of Completion
domain includes: Certificate of Participation
domain includes: Certification
domain includes: Credential
domain includes: Credential Component
domain includes: Degree
domain includes: Digital Badge
domain includes: Diploma
domain includes: Doctoral Degree
domain includes: General Education Development (GED)
domain includes: General Education Level 1 Certificate
domain includes: General Education Level 2 Certificate
domain includes: Higher Education Level 1 Certificate
domain includes: Higher Education Level 2 Certificate
domain includes: Journeyman Certificate
domain includes: License
domain includes: Master Trade Certificate
domain includes: Master's Degree
domain includes: Master of Arts Degree
domain includes: Master of Science Degree
domain includes: Micro-Credential
domain includes: Open Badge
domain includes: Post-Baccalaureate Certificate
domain includes: Post-Master Certificate
domain includes: Pre-Apprenticeship Certificate
domain includes: Professional Certificate
domain includes: Professional Doctorate
domain includes: Proficiency Certificate
domain includes: Quality Assurance Credential
domain includes: Research Doctorate
domain includes: Secondary Education Certificate
domain includes: Secondary School Diploma
domain includes: Specialist Degree
domain includes: Technical Level 1 Certificate
domain includes: Technical Level 2 Certificate
domain includes: Technical Level 3 Certificate
domain includes: Work-Based Learning Certificate
range includes: Academic Certificate
range includes: Apprentice Certificate
range includes: Associate Degree
range includes: Bachelor's Degree
range includes: Badge
range includes: Basic Technical Certificate
range includes: Certificate
range includes: Certificate of Completion
range includes: Certificate of Participation
range includes: Certification
range includes: Credential Type
range includes: Degree
range includes: Digital Badge
range includes: Diploma
range includes: Doctoral Degree
range includes: General Education Development (GED)
range includes: General Education Level 1 Certificate
range includes: General Education Level 2 Certificate
range includes: Higher Education Level 1 Certificate
range includes: Higher Education Level 2 Certificate
range includes: Journeyman Certificate
range includes: License
range includes: Master Trade Certificate
range includes: Master's Degree
range includes: Micro-Credential

Credit Level Type
type: Property
comment: The level of credit associated with the credit awarded or required.
term status: stable
domain includes: Value Profile
range includes: Concept

Credit Unit Type
type: Property
comment: The type of credit associated with the credit awarded or required.
term status: stable
domain includes: Value Profile
range includes: Concept

Credit Unit Type Description
type: Property
comment: Detailed description of credit unit type.
term status: stable
domain includes: Assessment Profile
domain includes: Condition Profile
domain includes: Course
domain includes: Learning Opportunity Profile
domain includes: Learning Program
range includes: langString

Credit Value
type: Property
comment: A credit-related value.
term status: stable
domain includes: Assessment Profile
domain includes: Condition Profile
domain includes: Course
domain includes: Course Component
domain includes: Learning Opportunity Profile
domain includes: Learning Program
domain includes: Transfer Intermediary
range includes: Value Profile

CTID
type: Property
comment: Globally unique Credential Transparency Identifier (CTID) by which the creator, owner or provider of a resource recognizes it in transactions with the external environment (e.g., in verifiable claims involving the resource).
description: The CTID is the equivalent of a version identifier for the resource. Different versions of a resource are considered distinct expressions and each must be assigned its own CTID. Each version of a resource can have only one CTID assigned. However, a single version of a resource may have distinct identifier values for both the ctid property and the credentialId property. In such a case both identifiers will be recognized by the resource creator/owner/provider in transactions with the external environment.
term status: stable
sub property of: Credential Identifier
domain includes: ProgressionLevel
domain includes: ProgressionModel
domain includes: Competency
domain includes: CompetencyFramework
domain includes: Rubric
domain includes: RubricCriterion
domain includes: Academic Certificate
domain includes: Accredit Action
domain includes: Advanced Standing Action
domain includes: Alignment Map
domain includes: Apprentice Certificate
domain includes: Approve Action
domain includes: Assessment Component
domain includes: Assessment Profile
domain includes: Associate Degree
domain includes: Associate of Applied Arts Degree
domain includes: Associate of Applied Science Degree
domain includes: Associate of Arts Degree
domain includes: Associate of Science Degree
domain includes: Bachelor's Degree
domain includes: Bachelor of Arts Degree
domain includes: Bachelor of Science Degree
domain includes: Badge
domain includes: Basic Component
domain includes: Basic Technical Certificate
domain includes: Certificate
domain includes: Certificate of Completion
domain includes: Certificate of Participation
domain includes: Certification
domain includes: Cocurricular Component
domain includes: Collection
domain includes: Collection Component
domain includes: Competency Component
domain includes: Condition Manifest
domain includes: Cost Manifest
domain includes: Course
domain includes: Course Component
domain includes: Credential
domain includes: Credential Component
domain includes: Credentialing Action
domain includes: Credential Organization
domain includes: Credential Type
domain includes: Degree
domain includes: Digital Badge
domain includes: Diploma
domain includes: Doctoral Degree
domain includes: Extracurricular Component
domain includes: Financial Assistance Profile
domain includes: General Education Development (GED)
domain includes: General Education Level 1 Certificate
domain includes: General Education Level 2 Certificate
domain includes: Higher Education Level 1 Certificate
domain includes: Higher Education Level 2 Certificate
domain includes: Industry
domain includes: Job
domain includes: Job Component
domain includes: Journeyman Certificate
domain includes: Learning Opportunity Profile
domain includes: Learning Program
domain includes: License
domain includes: Master Trade Certificate
domain includes: Master's Degree
domain includes: Master of Arts Degree
domain includes: Master of Science Degree
domain includes: Micro-Credential
domain includes: Multi Component
domain includes: Occupation
domain includes: Offer Action
domain includes: Open Badge
domain includes: Organization
domain includes: Pathway
domain includes: Pathway Set
domain includes: Post-Baccalaureate Certificate
domain includes: Post-Master Certificate

Currency
type: Property
comment: Currency in which the monetary amount is expressed in 3-letter ISO 4217 format such as "USD".
term status: stable
domain includes: Aggregate Data Profile
domain includes: Cost Profile
range includes: string
equivalent property: currency

Date Effective
type: Property
comment: Date after which this resource is available or applicable.
term status: stable
sub property of: Temporal Coverage
domain includes: Academic Certificate
domain includes: Aggregate Data Profile
domain includes: Alignment Map
domain includes: Apprentice Certificate
domain includes: Assessment Profile
domain includes: Associate Degree
domain includes: Associate of Applied Arts Degree
domain includes: Associate of Applied Science Degree
domain includes: Associate of Arts Degree
domain includes: Associate of Science Degree
domain includes: Bachelor's Degree
domain includes: Bachelor of Arts Degree
domain includes: Bachelor of Science Degree
domain includes: Badge
domain includes: Basic Technical Certificate
domain includes: Certificate
domain includes: Certificate of Completion
domain includes: Certificate of Participation
domain includes: Certification
domain includes: Collection
domain includes: Condition Profile
domain includes: Course
domain includes: Credential
domain includes: Credential Type
domain includes: Degree
domain includes: Digital Badge
domain includes: Diploma
domain includes: Doctoral Degree
domain includes: Earnings Profile
domain includes: Employment Outcome Profile
domain includes: General Education Development (GED)
domain includes: General Education Level 1 Certificate
domain includes: General Education Level 2 Certificate
domain includes: Higher Education Level 1 Certificate
domain includes: Higher Education Level 2 Certificate
domain includes: Holders Profile
domain includes: Journeyman Certificate
domain includes: Learning Opportunity Profile
domain includes: Learning Program
domain includes: License
domain includes: Master Trade Certificate
domain includes: Master's Degree
domain includes: Master of Arts Degree
domain includes: Master of Science Degree
domain includes: Micro-Credential
domain includes: Open Badge
domain includes: Post-Baccalaureate Certificate
domain includes: Post-Master Certificate
domain includes: Pre-Apprenticeship Certificate
domain includes: Prior Learning Policy
domain includes: Process Profile
domain includes: Professional Certificate
domain includes: Professional Doctorate
domain includes: Proficiency Certificate
domain includes: Qualifications Framework
domain includes: Quality Assurance Credential
domain includes: Research Doctorate
domain includes: Revocation Profile
domain includes: Secondary Education Certificate
domain includes: Secondary School Diploma
domain includes: Specialist Degree
domain includes: Support Service
domain includes: Technical Level 1 Certificate
domain includes: Technical Level 2 Certificate
domain includes: Technical Level 3 Certificate
domain includes: Transfer Agreement
domain includes: Verification Service Profile
domain includes: Work-Based Learning Certificate
domain includes: DataSetDistribution
domain includes: DataSetProfile
range includes: date

Date Signed
type: Property
comment: Date on which the document being described was signed.
term status: unstable
domain includes: Prior Learning Policy
domain includes: Transfer Agreement
range includes: date

Degree Concentration
type: Property
comment: Focused plan of study within a college or university degree such as a concentration in Aerospace Engineering within an Engineering degree.
usage note: Where possible, values should be taken from published frameworks defining degree majors, minors, and concentrations such as the U.S. National Center for Education Statistics' (NCES) Classification of Instructional Programs (CIP).
term status: stable
domain includes: Associate Degree
domain includes: Associate of Applied Arts Degree
domain includes: Associate of Applied Science Degree
domain includes: Associate of Arts Degree
domain includes: Associate of Science Degree
domain includes: Bachelor's Degree
domain includes: Bachelor of Arts Degree
domain includes: Bachelor of Science Degree
domain includes: Degree
domain includes: Doctoral Degree
domain includes: Learning Opportunity Profile
domain includes: Learning Program
domain includes: Master's Degree
domain includes: Master of Arts Degree
domain includes: Master of Science Degree
range includes: Credential Alignment Object

Degree Major
type: Property
comment: Primary field of study of a degree-seeking student.
usage note: Where possible, values should be taken from published frameworks defining degree majors, minors, and concentrations such as the U.S. National Center for Education Statistics' (NCES) Classification of Instructional Programs (CIP).
term status: stable
domain includes: Associate Degree
domain includes: Associate of Applied Arts Degree
domain includes: Associate of Applied Science Degree
domain includes: Associate of Arts Degree
domain includes: Associate of Science Degree
domain includes: Bachelor's Degree
domain includes: Bachelor of Arts Degree
domain includes: Bachelor of Science Degree
domain includes: Degree
domain includes: Doctoral Degree
domain includes: Master's Degree
domain includes: Master of Arts Degree
domain includes: Master of Science Degree
range includes: Credential Alignment Object

Degree Minor
type: Property
comment: Optional, secondary field of study of a degree-seeking student.
usage note: Where possible, values should be taken from published frameworks defining degree majors, minors, and concentrations such as the U.S. National Center for Education Statistics' (NCES) Classification of Instructional Programs (CIP).
term status: stable
domain includes: Associate Degree
domain includes: Associate of Applied Arts Degree
domain includes: Associate of Applied Science Degree
domain includes: Associate of Arts Degree
domain includes: Associate of Science Degree
domain includes: Bachelor's Degree
domain includes: Bachelor of Arts Degree
domain includes: Bachelor of Science Degree
domain includes: Degree
domain includes: Doctoral Degree
domain includes: Master's Degree
domain includes: Master of Arts Degree
domain includes: Master of Science Degree
range includes: Credential Alignment Object

Delivery Type
type: Property
comment: Type of means by which a learning opportunity or assessment is delivered to credential seekers and by which they interact; select from an existing enumeration of such types.
usage note: Best practice is to use concepts from a controlled vocabulary such as the ceterms:DeliveryType vocabulary.
term status: stable
domain includes: Rubric
domain includes: Assessment Profile
domain includes: Course
domain includes: Learning Opportunity Profile
domain includes: Learning Program
domain includes: Scheduled Offering
domain includes: Support Service
range includes: Credential Alignment Object

Delivery Type Description
type: Property
comment: Detailed description of the delivery type of an assessment or learning opportunity.
term status: stable
domain includes: Assessment Profile
domain includes: Course
domain includes: Learning Opportunity Profile
domain includes: Learning Program
domain includes: Scheduled Offering
range includes: langString

Demographic Information
type: Property
comment: Aggregate data or summaries of statistical data relating to the population of credential holders including data about gender, geopolitical regions, age, education levels, and other categories of interest.
term status: stable
domain includes: Aggregate Data Profile
domain includes: Holders Profile
range includes: langString

Department
type: Property
comment: Department of the organization.
term status: stable
sub property of: Sub-Organization
domain includes: Credential Organization
domain includes: Organization
domain includes: QA Credential Organization
range includes: Credential Organization
range includes: Organization
range includes: QA Credential Organization
equivalent property: department

Description
type: Property
comment: Statement, characterization or account of the entity.
term status: stable
domain includes: Academic Certificate
domain includes: Accredit Action
domain includes: Advanced Standing Action
domain includes: Aggregate Data Profile
domain includes: Alignment Map
domain includes: Alignment Object
domain includes: Apprentice Certificate
domain includes: Approve Action
domain includes: Assessment Component
domain includes: Assessment Profile
domain includes: Associate Degree
domain includes: Associate of Applied Arts Degree
domain includes: Associate of Applied Science Degree
domain includes: Associate of Arts Degree
domain includes: Associate of Science Degree
domain includes: Bachelor's Degree
domain includes: Bachelor of Arts Degree
domain includes: Bachelor of Science Degree
domain includes: Badge
domain includes: Basic Component
domain includes: Basic Technical Certificate
domain includes: Certificate
domain includes: Certificate of Completion
domain includes: Certificate of Participation
domain includes: Certification
domain includes: Cocurricular Component
domain includes: Collection
domain includes: Collection Component
domain includes: Collection Member
domain includes: Competency Component
domain includes: Component Condition
domain includes: Condition Manifest
domain includes: Condition Profile
domain includes: Constraint
domain includes: Cost Manifest
domain includes: Cost Profile
domain includes: Course
domain includes: Course Component
domain includes: Credential
domain includes: Credential Component
domain includes: Credentialing Action
domain includes: Credential Organization
domain includes: Credential Type
domain includes: Degree
domain includes: Digital Badge
domain includes: Diploma
domain includes: Doctoral Degree
domain includes: Duration Profile
domain includes: Earnings Profile
domain includes: Employment Outcome Profile
domain includes: Evaluation Outcome
domain includes: Extracurricular Component
domain includes: Financial Assistance Profile
domain includes: General Education Development (GED)
domain includes: General Education Level 1 Certificate
domain includes: General Education Level 2 Certificate
domain includes: Higher Education Level 1 Certificate
domain includes: Higher Education Level 2 Certificate
domain includes: Holders Profile
domain includes: Industry
domain includes: Job
domain includes: Job Component
domain includes: Journeyman Certificate
domain includes: Jurisdiction Profile
domain includes: Learning Opportunity Profile
domain includes: Learning Program
domain includes: License
domain includes: Master Trade Certificate
domain includes: Master's Degree
domain includes: Master of Arts Degree
domain includes: Master of Science Degree
domain includes: Micro-Credential
domain includes: Multi Component
domain includes: Occupation
domain includes: Offer Action
domain includes: Open Badge

Development Process
type: Property
comment: Description of a process by which a resource was created.
term status: stable
domain includes: Competency
domain includes: CompetencyFramework
domain includes: Rubric
domain includes: Academic Certificate
domain includes: Alignment Map
domain includes: Apprentice Certificate
domain includes: Assessment Profile
domain includes: Associate Degree
domain includes: Associate of Applied Arts Degree
domain includes: Associate of Applied Science Degree
domain includes: Associate of Arts Degree
domain includes: Associate of Science Degree
domain includes: Bachelor's Degree
domain includes: Bachelor of Arts Degree
domain includes: Bachelor of Science Degree
domain includes: Badge
domain includes: Basic Technical Certificate
domain includes: Certificate
domain includes: Certificate of Completion
domain includes: Certificate of Participation
domain includes: Certification
domain includes: Collection
domain includes: Condition Manifest
domain includes: Cost Manifest
domain includes: Course
domain includes: Credential
domain includes: Credential Organization
domain includes: Degree
domain includes: Digital Badge
domain includes: Diploma
domain includes: Doctoral Degree
domain includes: Evaluation Outcome
domain includes: General Education Development (GED)
domain includes: General Education Level 1 Certificate
domain includes: General Education Level 2 Certificate
domain includes: Higher Education Level 1 Certificate
domain includes: Higher Education Level 2 Certificate
domain includes: Job
domain includes: Journeyman Certificate
domain includes: Learning Opportunity Profile
domain includes: Learning Program
domain includes: License
domain includes: Master Trade Certificate
domain includes: Master's Degree
domain includes: Master of Arts Degree
domain includes: Master of Science Degree
domain includes: Micro-Credential
domain includes: Occupation
domain includes: Open Badge
domain includes: Organization
domain includes: Pathway
domain includes: Pathway Set
domain includes: Post-Baccalaureate Certificate
domain includes: Post-Master Certificate
domain includes: Pre-Apprenticeship Certificate
domain includes: Prior Learning Policy
domain includes: Professional Certificate
domain includes: Professional Doctorate
domain includes: Proficiency Certificate
domain includes: QA Credential Organization
domain includes: Qualifications Framework
domain includes: Quality Assurance Credential
domain includes: Research Doctorate
domain includes: Secondary Education Certificate
domain includes: Secondary School Diploma
domain includes: Specialist Degree
domain includes: Support Service
domain includes: Task
domain includes: Technical Level 1 Certificate
domain includes: Technical Level 2 Certificate
domain includes: Technical Level 3 Certificate
domain includes: Transfer Agreement
domain includes: Transfer Intermediary
domain includes: Transfer Value Profile
domain includes: Work-Based Learning Certificate
domain includes: Work Role

Direct Cost Type
type: Property
comment: Types of direct costs associated with earning or completing a credential, assessment or learning opportunity; select from an existing enumeration of such types.
usage note: Best practice for developing credential descriptions for the Credential Engine Registry is to use the ceterms:CostType vocabulary.
term status: stable
sub property of: credentialAlignment
domain includes: Cost Profile
range includes: Credential Alignment Object

DUNS
type: Property
comment: Dun & Bradstreet DUNS number for identifying an organization or business person.
term status: stable
domain includes: Credential Organization
domain includes: Organization
domain includes: QA Credential Organization
range includes: string
equivalent property: duns

Earnings
type: Property
comment: Entity describing aggregate credential holder earnings data.
usage note: The use of ceterms:aggregateData instead of this property is strongly recommended.
term status: stable
sub property of: Aggregate Data
domain includes: Academic Certificate
domain includes: Apprentice Certificate
domain includes: Associate Degree
domain includes: Associate of Applied Arts Degree
domain includes: Associate of Applied Science Degree
domain includes: Associate of Arts Degree
domain includes: Associate of Science Degree
domain includes: Bachelor's Degree
domain includes: Bachelor of Arts Degree
domain includes: Bachelor of Science Degree
domain includes: Badge
domain includes: Basic Technical Certificate
domain includes: Certificate
domain includes: Certificate of Completion
domain includes: Certificate of Participation
domain includes: Certification
domain includes: Credential
domain includes: Degree
domain includes: Digital Badge
domain includes: Diploma
domain includes: Doctoral Degree
domain includes: General Education Development (GED)
domain includes: General Education Level 1 Certificate
domain includes: General Education Level 2 Certificate
domain includes: Higher Education Level 1 Certificate
domain includes: Higher Education Level 2 Certificate
domain includes: Journeyman Certificate
domain includes: License
domain includes: Master Trade Certificate
domain includes: Master's Degree
domain includes: Master of Arts Degree
domain includes: Master of Science Degree
domain includes: Micro-Credential
domain includes: Open Badge
domain includes: Post-Baccalaureate Certificate
domain includes: Post-Master Certificate
domain includes: Pre-Apprenticeship Certificate
domain includes: Professional Certificate
domain includes: Professional Doctorate
domain includes: Proficiency Certificate
domain includes: Quality Assurance Credential
domain includes: Research Doctorate
domain includes: Secondary Education Certificate
domain includes: Secondary School Diploma
domain includes: Specialist Degree
domain includes: Technical Level 1 Certificate
domain includes: Technical Level 2 Certificate
domain includes: Technical Level 3 Certificate
domain includes: Work-Based Learning Certificate
range includes: Earnings Profile

Email
type: Property
comment: Email address of the organization or person.
term status: stable
domain includes: Contact Point
domain includes: Credential Organization
domain includes: Organization
domain includes: QA Credential Organization
range includes: string
equivalent property: email

Employee
type: Property
comment: Person employed for wages or salary by the organization.
term status: stable
domain includes: Credential Organization
domain includes: Organization
domain includes: QA Credential Organization
range includes: CredentialPerson
equivalent property: employee

Employment Outcome
type: Property
comment: Entity describing aggregate data on jobs obtained with the credential by occupation and industry for a given period of time in a specific region.
usage note: The use of ceterms:aggregateData instead of this property is strongly recommended.
term status: stable
sub property of: Aggregate Data
domain includes: Academic Certificate
domain includes: Apprentice Certificate
domain includes: Associate Degree
domain includes: Associate of Applied Arts Degree
domain includes: Associate of Applied Science Degree
domain includes: Associate of Arts Degree
domain includes: Associate of Science Degree
domain includes: Bachelor's Degree
domain includes: Bachelor of Arts Degree
domain includes: Bachelor of Science Degree
domain includes: Badge
domain includes: Basic Technical Certificate
domain includes: Certificate
domain includes: Certificate of Completion
domain includes: Certificate of Participation
domain includes: Certification
domain includes: Credential
domain includes: Degree
domain includes: Digital Badge
domain includes: Diploma
domain includes: Doctoral Degree
domain includes: General Education Development (GED)
domain includes: General Education Level 1 Certificate
domain includes: General Education Level 2 Certificate
domain includes: Higher Education Level 1 Certificate
domain includes: Higher Education Level 2 Certificate
domain includes: Journeyman Certificate
domain includes: License
domain includes: Master Trade Certificate
domain includes: Master's Degree
domain includes: Master of Arts Degree
domain includes: Master of Science Degree
domain includes: Micro-Credential
domain includes: Open Badge
domain includes: Post-Baccalaureate Certificate
domain includes: Post-Master Certificate
domain includes: Pre-Apprenticeship Certificate
domain includes: Professional Certificate
domain includes: Professional Doctorate
domain includes: Proficiency Certificate
domain includes: Quality Assurance Credential
domain includes: Research Doctorate
domain includes: Secondary Education Certificate
domain includes: Secondary School Diploma
domain includes: Specialist Degree
domain includes: Technical Level 1 Certificate
domain includes: Technical Level 2 Certificate
domain includes: Technical Level 3 Certificate
domain includes: Work-Based Learning Certificate
range includes: Employment Outcome Profile

End Date
type: Property
comment: Date some event or activity ends.
term status: stable
sub property of: Temporal Coverage
domain includes: Accredit Action
domain includes: Advanced Standing Action
domain includes: Approve Action
domain includes: Collection Member
domain includes: Cost Manifest
domain includes: Cost Profile
domain includes: Credentialing Action
domain includes: Offer Action
domain includes: Recognize Action
domain includes: Registration Action
domain includes: Regulate Action
domain includes: Renew Action
domain includes: Revoke Action
domain includes: Rights Action
domain includes: Transfer Value Profile
domain includes: Workforce Demand Action
domain includes: DataSetTimeFrame
range includes: date
equivalent property: endDate

End Time
type: Property
comment: Time some event or activity ends.
term status: stable
sub property of: Temporal Coverage
range includes: dateTime
equivalent property: endTime

Entry Condition
type: Property
comment: Requirements for entry into a credentialing program, a learning opportunity, or an assessment, including credentials, transcripts, records of previous experience, or other forms of entry documentation.
usage note: For Courses required to be taken before entry into another Course, use prerequisite.
term status: stable
sub property of: Requires
domain includes: Assessment Profile
domain includes: Condition Manifest
domain includes: Course
domain includes: Learning Opportunity Profile
domain includes: Learning Program
range includes: Condition Profile

Environmental Hazard Type
type: Property
comment: Type of condition in the physical work performance environment that entails risk exposures requiring mitigating processes; select from an existing enumeration of such types.
description: Such types may include exposure to bloodborne pathogens, airborne communicable diseases and dangerous chemicals, battlefield conditions, fire fighting, law enforcement, and so on.
term status: unstable
domain includes: Competency
domain includes: Job
domain includes: Occupation
domain includes: Task
domain includes: Work Role
range includes: Concept

Estimated Cost
type: Property
comment: Estimated cost of a credential, learning opportunity or assessment.
term status: stable
domain includes: Academic Certificate
domain includes: Apprentice Certificate
domain includes: Assessment Profile
domain includes: Associate Degree
domain includes: Associate of Applied Arts Degree
domain includes: Associate of Applied Science Degree
domain includes: Associate of Arts Degree
domain includes: Associate of Science Degree
domain includes: Bachelor's Degree
domain includes: Bachelor of Arts Degree
domain includes: Bachelor of Science Degree
domain includes: Badge
domain includes: Basic Technical Certificate
domain includes: Certificate
domain includes: Certificate of Completion
domain includes: Certificate of Participation
domain includes: Certification
domain includes: Condition Profile
domain includes: Cost Manifest
domain includes: Course
domain includes: Credential
domain includes: Degree
domain includes: Digital Badge
domain includes: Diploma
domain includes: Doctoral Degree
domain includes: General Education Development (GED)
domain includes: General Education Level 1 Certificate
domain includes: General Education Level 2 Certificate
domain includes: Higher Education Level 1 Certificate
domain includes: Higher Education Level 2 Certificate
domain includes: Journeyman Certificate
domain includes: Learning Opportunity Profile
domain includes: Learning Program
domain includes: License
domain includes: Master Trade Certificate
domain includes: Master's Degree
domain includes: Master of Arts Degree
domain includes: Master of Science Degree
domain includes: Micro-Credential
domain includes: Open Badge
domain includes: Post-Baccalaureate Certificate
domain includes: Post-Master Certificate
domain includes: Pre-Apprenticeship Certificate
domain includes: Professional Certificate
domain includes: Professional Doctorate
domain includes: Proficiency Certificate
domain includes: Quality Assurance Credential
domain includes: Research Doctorate
domain includes: Scheduled Offering
domain includes: Secondary Education Certificate
domain includes: Secondary School Diploma
domain includes: Specialist Degree
domain includes: Support Service
domain includes: Technical Level 1 Certificate
domain includes: Technical Level 2 Certificate
domain includes: Technical Level 3 Certificate
domain includes: Verification Service Profile
domain includes: Work-Based Learning Certificate
range includes: Cost Profile

Estimated Duration
type: Property
comment: Estimated time it will take to complete an activity, event, or resource.
term status: stable
domain includes: Academic Certificate
domain includes: Apprentice Certificate
domain includes: Assessment Profile
domain includes: Associate Degree
domain includes: Associate of Applied Arts Degree
domain includes: Associate of Applied Science Degree
domain includes: Associate of Arts Degree
domain includes: Associate of Science Degree
domain includes: Bachelor's Degree
domain includes: Bachelor of Arts Degree
domain includes: Bachelor of Science Degree
domain includes: Badge
domain includes: Basic Technical Certificate
domain includes: Certificate
domain includes: Certificate of Completion
domain includes: Certificate of Participation
domain includes: Certification
domain includes: Course
domain includes: Credential
domain includes: Credential Type
domain includes: Degree
domain includes: Digital Badge
domain includes: Diploma
domain includes: Doctoral Degree
domain includes: General Education Development (GED)
domain includes: General Education Level 1 Certificate
domain includes: General Education Level 2 Certificate
domain includes: Higher Education Level 1 Certificate
domain includes: Higher Education Level 2 Certificate
domain includes: Journeyman Certificate
domain includes: Learning Opportunity Profile
domain includes: Learning Program
domain includes: License
domain includes: Master Trade Certificate
domain includes: Master's Degree
domain includes: Master of Arts Degree
domain includes: Master of Science Degree
domain includes: Micro-Credential
domain includes: Open Badge
domain includes: Post-Baccalaureate Certificate
domain includes: Post-Master Certificate
domain includes: Pre-Apprenticeship Certificate
domain includes: Professional Certificate
domain includes: Professional Doctorate
domain includes: Proficiency Certificate
domain includes: Quality Assurance Credential
domain includes: Research Doctorate
domain includes: Scheduled Offering
domain includes: Secondary Education Certificate
domain includes: Secondary School Diploma
domain includes: Specialist Degree
domain includes: Technical Level 1 Certificate
domain includes: Technical Level 2 Certificate
domain includes: Technical Level 3 Certificate
domain includes: Work-Based Learning Certificate
range includes: Duration Profile

Evaluation Evidence
type: Property
comment: Summary of evidence about this resource.
term status: unstable
domain includes: Transfer Value Profile
range includes: Evaluation Outcome

Evaluation Process
type: Property
comment: Description of a process used to appraise this resource.
term status: unstable
domain includes: Transfer Value Profile
range includes: Process Profile

Evidence of Action
type: Property
comment: Entity that proves that the action occurred or that the action continues to be valid.
description: The evidence verifies the information in the action and is particular to it. It is not a collection relating to several unrelated actions or a description of how such verifications might generically be characterized. It may comprise more than one evidentiary entity relating to the same action.
term status: stable
domain includes: Accredit Action
domain includes: Advanced Standing Action
domain includes: Approve Action
domain includes: Credentialing Action
domain includes: Offer Action
domain includes: Recognize Action
domain includes: Registration Action
domain includes: Regulate Action
domain includes: Renew Action
domain includes: Revoke Action
domain includes: Rights Action
domain includes: Workforce Demand Action
range includes: anyURI

Exact Alignment
type: Property
comment: Relevant concepts in two entities being compared are coextensive.
term status: stable
sub property of: Is Similar To
domain includes: Academic Certificate
domain includes: Apprentice Certificate
domain includes: Associate Degree
domain includes: Associate of Applied Arts Degree
domain includes: Associate of Applied Science Degree
domain includes: Associate of Arts Degree
domain includes: Associate of Science Degree
domain includes: Bachelor's Degree
domain includes: Bachelor of Arts Degree
domain includes: Bachelor of Science Degree
domain includes: Badge
domain includes: Basic Technical Certificate
domain includes: Certificate
domain includes: Certificate of Completion
domain includes: Certificate of Participation
domain includes: Certification
domain includes: Credential
domain includes: Credential Type
domain includes: Degree
domain includes: Digital Badge
domain includes: Diploma
domain includes: Doctoral Degree
domain includes: General Education Development (GED)
domain includes: General Education Level 1 Certificate
domain includes: General Education Level 2 Certificate
domain includes: Higher Education Level 1 Certificate
domain includes: Higher Education Level 2 Certificate
domain includes: Journeyman Certificate
domain includes: License
domain includes: Master Trade Certificate
domain includes: Master's Degree
domain includes: Master of Arts Degree
domain includes: Master of Science Degree
domain includes: Micro-Credential
domain includes: Open Badge
domain includes: Post-Baccalaureate Certificate
domain includes: Post-Master Certificate
domain includes: Pre-Apprenticeship Certificate
domain includes: Professional Certificate
domain includes: Professional Doctorate
domain includes: Proficiency Certificate
domain includes: Quality Assurance Credential
domain includes: Research Doctorate
domain includes: Secondary Education Certificate
domain includes: Secondary School Diploma
domain includes: Specialist Degree
domain includes: Technical Level 1 Certificate
domain includes: Technical Level 2 Certificate
domain includes: Technical Level 3 Certificate
domain includes: Work-Based Learning Certificate
range includes: Academic Certificate
range includes: Apprentice Certificate
range includes: Associate Degree
range includes: Associate of Applied Arts Degree
range includes: Associate of Applied Science Degree
range includes: Associate of Arts Degree
range includes: Associate of Science Degree
range includes: Bachelor's Degree
range includes: Bachelor of Arts Degree
range includes: Bachelor of Science Degree
range includes: Badge
range includes: Basic Technical Certificate
range includes: Certificate
range includes: Certificate of Completion
range includes: Certificate of Participation
range includes: Certification
range includes: Credential
range includes: Credential Type
range includes: Degree
range includes: Digital Badge
range includes: Diploma
range includes: Doctoral Degree
range includes: General Education Development (GED)
range includes: General Education Level 1 Certificate
range includes: General Education Level 2 Certificate

Exact Duration
type: Property
comment: Overall span of time it will take to complete the activity, event, or resource.
description: This is intended to indicate overall time span, regardless of what portion of that time is spent actively pursuing the completion of the activity, event, or resource.
usage note: If a resource takes 50 hours over a span of 6 months to complete, use this to record 6 months as P6M.
term status: stable
domain includes: Duration Profile
range includes: Duration

Experience
type: Property
comment: Amount and nature of required work, experiential learning or other relevant experience.
term status: stable
domain includes: Condition Profile
range includes: langString

Expiration Date
type: Property
comment: Date beyond which the resource is no longer offered or available.
description: Previously earned, completed, or attained resources may still be valid even if they are no longer offered.
term status: stable
domain includes: Academic Certificate
domain includes: Aggregate Data Profile
domain includes: Alignment Map
domain includes: Apprentice Certificate
domain includes: Assessment Profile
domain includes: Associate Degree
domain includes: Associate of Applied Arts Degree
domain includes: Associate of Applied Science Degree
domain includes: Associate of Arts Degree
domain includes: Associate of Science Degree
domain includes: Bachelor's Degree
domain includes: Bachelor of Arts Degree
domain includes: Bachelor of Science Degree
domain includes: Badge
domain includes: Basic Technical Certificate
domain includes: Certificate
domain includes: Certificate of Completion
domain includes: Certificate of Participation
domain includes: Certification
domain includes: Collection
domain includes: Course
domain includes: Credential
domain includes: Credential Type
domain includes: Degree
domain includes: Digital Badge
domain includes: Diploma
domain includes: Doctoral Degree
domain includes: General Education Development (GED)
domain includes: General Education Level 1 Certificate
domain includes: General Education Level 2 Certificate
domain includes: Higher Education Level 1 Certificate
domain includes: Higher Education Level 2 Certificate
domain includes: Journeyman Certificate
domain includes: Learning Opportunity Profile
domain includes: Learning Program
domain includes: License
domain includes: Master Trade Certificate
domain includes: Master's Degree
domain includes: Master of Arts Degree
domain includes: Master of Science Degree
domain includes: Micro-Credential
domain includes: Open Badge
domain includes: Post-Baccalaureate Certificate
domain includes: Post-Master Certificate
domain includes: Pre-Apprenticeship Certificate
domain includes: Prior Learning Policy
domain includes: Professional Certificate
domain includes: Professional Doctorate
domain includes: Proficiency Certificate
domain includes: Qualifications Framework
domain includes: Quality Assurance Credential
domain includes: Research Doctorate
domain includes: Secondary Education Certificate
domain includes: Secondary School Diploma
domain includes: Specialist Degree
domain includes: Support Service
domain includes: Technical Level 1 Certificate
domain includes: Technical Level 2 Certificate
domain includes: Technical Level 3 Certificate
domain includes: Transfer Agreement
domain includes: Work-Based Learning Certificate
range includes: date

External Input Type
type: Property
comment: Types of external stakeholders that provide input to an entity's processes or resources; select from an existing enumeration of such types.
usage note: Best practice for developing credential descriptions for the Credential Engine Registry is to use the ceterms:ExternalInput vocabulary.
term status: stable
sub property of: credentialAlignment
domain includes: Process Profile
range includes: Credential Alignment Object

External Research
type: Property
comment: Research that supports or validates one or more aspects of the entity.
term status: stable
domain includes: Assessment Profile
range includes: anyURI

Faceted Description
type: Property
comment: Description of a specific aspect or characteristic of this resource.
usage note: Use for the level descriptors of a Qualifications Framework when these are defined in terms of several different types of competency.
term status: unstable
domain includes: ProgressionLevel
range includes: Competency

Family Name
type: Property
comment: Family name such as the last name of a person in the U.S..
description: The ceterms:familyName property can be used along with givenName instead of the ceterms:name property.
term status: stable
domain includes: CredentialPerson
range includes: langString
equivalent property: familyName

Fax Number
type: Property
comment: Fax number.
term status: stable
domain includes: Contact Point
range includes: string
equivalent property: faxNumber

FEIN
type: Property
comment: Federal Employer Identification Number (FEIN) identifying organizations, persons, states, government agencies, corporations, and companies.
term status: stable
domain includes: Credential Organization
domain includes: Organization
domain includes: QA Credential Organization
range includes: string

Financial Assistance
type: Property
comment: Entity that describes financial assistance for which this resource qualifies.
description: The type of resource that the financial aid is associated with is dependent on context.
term status: stable
domain includes: Academic Certificate
domain includes: Apprentice Certificate
domain includes: Assessment Profile
domain includes: Associate Degree
domain includes: Associate of Applied Arts Degree
domain includes: Associate of Applied Science Degree
domain includes: Associate of Arts Degree
domain includes: Associate of Science Degree
domain includes: Bachelor's Degree
domain includes: Bachelor of Arts Degree
domain includes: Bachelor of Science Degree
domain includes: Badge
domain includes: Basic Technical Certificate
domain includes: Certificate
domain includes: Certificate of Completion
domain includes: Certificate of Participation
domain includes: Certification
domain includes: Course
domain includes: Credential
domain includes: Credential Type
domain includes: Degree
domain includes: Digital Badge
domain includes: Diploma
domain includes: Doctoral Degree
domain includes: General Education Development (GED)
domain includes: General Education Level 1 Certificate
domain includes: General Education Level 2 Certificate
domain includes: Higher Education Level 1 Certificate
domain includes: Higher Education Level 2 Certificate
domain includes: Journeyman Certificate
domain includes: Learning Opportunity Profile
domain includes: Learning Program
domain includes: License
domain includes: Master Trade Certificate
domain includes: Master's Degree
domain includes: Master of Arts Degree
domain includes: Master of Science Degree
domain includes: Micro-Credential
domain includes: Open Badge
domain includes: Post-Baccalaureate Certificate
domain includes: Post-Master Certificate
domain includes: Pre-Apprenticeship Certificate
domain includes: Professional Certificate
domain includes: Professional Doctorate
domain includes: Proficiency Certificate
domain includes: Quality Assurance Credential
domain includes: Research Doctorate
domain includes: Secondary Education Certificate
domain includes: Secondary School Diploma
domain includes: Specialist Degree
domain includes: Support Service
domain includes: Technical Level 1 Certificate
domain includes: Technical Level 2 Certificate
domain includes: Technical Level 3 Certificate
domain includes: Work-Based Learning Certificate
range includes: Financial Assistance Profile

Financial Assistance Type
type: Property
comment: Type of financial assistance; select from an existing enumeration of such types.
term status: stable
domain includes: Financial Assistance Profile
range includes: Credential Alignment Object

Financial Assistance Value
type: Property
comment: Description of the amount of financial assistance available.
term status: stable
domain includes: Financial Assistance Profile
range includes: Quantitative Value

Founding Date
type: Property
comment: Date the organization was founded.
term status: stable
sub property of: Temporal Coverage
domain includes: Credential Organization
domain includes: Organization
domain includes: QA Credential Organization
range includes: string
equivalent property: foundingDate

Framework URL
type: Property
comment: Credential framework to which the entity is aligned.
description: Frameworks may include, but are not limited to, competency frameworks and concept schemes such as industry, occupation, and instructional program codes.
term status: stable
domain includes: Credential Alignment Object
domain includes: FinancialAlignmentObject
range includes: anyURI

Framework Name
type: Property
comment: Name of the framework.
term status: stable
domain includes: Credential Alignment Object
domain includes: FinancialAlignmentObject
range includes: langString
equivalent property: educationalFramework

Geographic URI
type: Property
comment: Entity that describes the longitude, latitude and other location details of a place.
description: This may define a place at any scale. Examples include a city, state, province, country, or continent.
usage note: It is recommended to use services such as http://www.geonames.org to provide values for this property.
term status: stable
domain includes: Geographic Coordinates
domain includes: Place
range includes: anyURI

Given Name
type: Property
comment: First name of a person.
usage note: Family name can be used along with familyName instead of the name property.
term status: stable
domain includes: CredentialPerson
range includes: langString
equivalent property: givenName

Global Jurisdiction
type: Property
comment: Whether or not the credential is useful, applicable or recognized everywhere.
description: Exceptions indicated by the ceterms:jurisdictionException property apply.
term status: stable
domain includes: Jurisdiction Profile
range includes: boolean

Has Alignment Map
type: Property
comment: Alignment map owned by the agent.
term status: stable
domain includes: Credential Organization
domain includes: Organization
domain includes: QA Credential Organization
range includes: Alignment Map

Has Catalog
type: Property
comment: An inventory or listing of resources maintained by this Organization
term status: unstable
domain includes: Credential Organization
domain includes: Organization
domain includes: QA Credential Organization
range includes: anyURI

Has Condition
type: Property
comment: Resource referenced defines a condition by which this resource is satisfied in full or in part.
term status: stable
domain includes: Assessment Component
domain includes: Basic Component
domain includes: Cocurricular Component
domain includes: Collection Component
domain includes: Competency Component
domain includes: Component Condition
domain includes: Course Component
domain includes: Credential Component
domain includes: Extracurricular Component
domain includes: Job Component
domain includes: Multi Component
domain includes: Work Experience Component
range includes: Component Condition

Has Condition Manifest
type: Property
comment: Entity that describes a set of constraints, prerequisites, entry conditions, or requirements applicable across the organization, sub-organization or sets of credentials or acitivites.
term status: stable
domain includes: Credential Organization
domain includes: Organization
domain includes: QA Credential Organization
range includes: Condition Manifest
inverse of: Condition Manifest Of

Has Constraint
type: Property
comment: Referenced resource defines a single constraint.
term status: unstable
domain includes: Component Condition
range includes: Constraint

Has Cost Manifest
type: Property
comment: Entity that describes a set of cost data applicable across the organization, sub-organization or sets of credentials or acitivites.
term status: stable
domain includes: Credential Organization
domain includes: Organization
domain includes: QA Credential Organization
range includes: Cost Manifest
inverse of: Cost Manifest Of

Has Destination Component
type: Property
comment: Goal or destination node of the pathway.
term status: stable
domain includes: Pathway
range includes: Assessment Component
range includes: Basic Component
range includes: Cocurricular Component
range includes: Collection Component
range includes: Competency Component
range includes: Course Component
range includes: Credential Component
range includes: Extracurricular Component
range includes: Job Component
range includes: Multi Component
range includes: Work Experience Component

Has Facet Scheme
type: Property
comment: Concept Scheme used to characterize different aspects (facets) of descriptors of nodes in a framework or similar resource.
term status: unstable
domain includes: Qualifications Framework
range includes: ConceptScheme

Has Glossary
type: Property
comment: Terms and definitions applicable to the resource.
term status: unstable
domain includes: CompetencyFramework
domain includes: Prior Learning Policy
domain includes: Qualifications Framework
domain includes: Transfer Agreement
range includes: ConceptScheme

Has Group Evaluation
type: Property
comment: Whether or not the assessment activity is scored as a group.
term status: stable
domain includes: Assessment Profile
range includes: boolean

Has Group Participation
type: Property
comment: Whether or not two or more participants are required to complete the assessment activity.
term status: stable
domain includes: Assessment Profile
range includes: boolean

Has Job
type: Property
comment: Job related to this resource.
term status: stable
domain includes: Industry
domain includes: Occupation
domain includes: Task
domain includes: Work Role
range includes: Job

Has Member
type: Property
comment: Resource in a Collection.
term status: unstable
domain includes: Collection
range includes: Resource

Has Occupation
type: Property
comment: Occupation related to this resource.
term status: stable
domain includes: Industry
domain includes: Job
domain includes: Task
domain includes: Work Role
range includes: Occupation

Has Offering
type: Property
comment: Indicates an offering and typical schedule.
usage note: Only use this property when it is necessary and useful to provide data about specific offerings of a learning opportunity or assessment, such as particular combinations of schedule, location, and delivery.
term status: unstable
domain includes: Assessment Profile
domain includes: Course
domain includes: Learning Opportunity Profile
domain includes: Learning Program
range includes: Scheduled Offering

Has Part
type: Property
comment: Indicates a separately identifiable and independently useful component of the entity.
description: Such partitive components can frequently be used in more than one context.
term status: stable
domain includes: Academic Certificate
domain includes: Alignment Map
domain includes: Apprentice Certificate
domain includes: Associate Degree
domain includes: Associate of Applied Arts Degree
domain includes: Associate of Applied Science Degree
domain includes: Associate of Arts Degree
domain includes: Associate of Science Degree
domain includes: Bachelor's Degree
domain includes: Bachelor of Arts Degree
domain includes: Bachelor of Science Degree
domain includes: Badge
domain includes: Basic Technical Certificate
domain includes: Certificate
domain includes: Certificate of Completion
domain includes: Certificate of Participation
domain includes: Certification
domain includes: Course
domain includes: Credential
domain includes: Degree
domain includes: Digital Badge
domain includes: Diploma
domain includes: Doctoral Degree
domain includes: General Education Development (GED)
domain includes: General Education Level 1 Certificate
domain includes: General Education Level 2 Certificate
domain includes: Higher Education Level 1 Certificate
domain includes: Higher Education Level 2 Certificate
domain includes: Journeyman Certificate
domain includes: Learning Opportunity Profile
domain includes: Learning Program
domain includes: License
domain includes: Master Trade Certificate
domain includes: Master's Degree
domain includes: Master of Arts Degree
domain includes: Master of Science Degree
domain includes: Micro-Credential
domain includes: Open Badge
domain includes: Pathway
domain includes: Post-Baccalaureate Certificate
domain includes: Post-Master Certificate
domain includes: Pre-Apprenticeship Certificate
domain includes: Prior Learning Policy
domain includes: Professional Certificate
domain includes: Professional Doctorate
domain includes: Proficiency Certificate
domain includes: Quality Assurance Credential
domain includes: Research Doctorate
domain includes: Secondary Education Certificate
domain includes: Secondary School Diploma
domain includes: Specialist Degree
domain includes: Technical Level 1 Certificate
domain includes: Technical Level 2 Certificate
domain includes: Technical Level 3 Certificate
domain includes: Work-Based Learning Certificate
range includes: Academic Certificate
range includes: Alignment Object
range includes: Apprentice Certificate
range includes: Assessment Component
range includes: Associate Degree
range includes: Associate of Applied Arts Degree
range includes: Associate of Applied Science Degree
range includes: Associate of Arts Degree
range includes: Associate of Science Degree
range includes: Bachelor's Degree
range includes: Bachelor of Arts Degree
range includes: Bachelor of Science Degree
range includes: Badge
range includes: Basic Component
range includes: Basic Technical Certificate
range includes: Certificate
range includes: Certificate of Completion
range includes: Certificate of Participation
range includes: Certification
range includes: Cocurricular Component

Has Pathway
type: Property
comment: A pathway related to this resource.
term status: stable
domain includes: Pathway Set
range includes: Pathway

Has Proxy
type: Property
comment: Indicates a resource that acts as a stand-in for the resource.
term status: unstable
domain includes: Academic Certificate
domain includes: Apprentice Certificate
domain includes: Assessment Profile
domain includes: Associate Degree
domain includes: Associate of Applied Arts Degree
domain includes: Associate of Applied Science Degree
domain includes: Associate of Arts Degree
domain includes: Associate of Science Degree
domain includes: Bachelor's Degree
domain includes: Bachelor of Arts Degree
domain includes: Bachelor of Science Degree
domain includes: Badge
domain includes: Basic Technical Certificate
domain includes: Certificate
domain includes: Certificate of Completion
domain includes: Certificate of Participation
domain includes: Certification
domain includes: Course
domain includes: Credential
domain includes: Credential Type
domain includes: Degree
domain includes: Digital Badge
domain includes: Diploma
domain includes: Doctoral Degree
domain includes: General Education Development (GED)
domain includes: General Education Level 1 Certificate
domain includes: General Education Level 2 Certificate
domain includes: Higher Education Level 1 Certificate
domain includes: Higher Education Level 2 Certificate
domain includes: Journeyman Certificate
domain includes: Learning Opportunity Profile
domain includes: Learning Program
domain includes: License
domain includes: Master Trade Certificate
domain includes: Master's Degree
domain includes: Master of Arts Degree
domain includes: Master of Science Degree
domain includes: Micro-Credential
domain includes: Open Badge
domain includes: Post-Baccalaureate Certificate
domain includes: Post-Master Certificate
domain includes: Pre-Apprenticeship Certificate
domain includes: Professional Certificate
domain includes: Professional Doctorate
domain includes: Proficiency Certificate
domain includes: Quality Assurance Credential
domain includes: Research Doctorate
domain includes: Secondary Education Certificate
domain includes: Secondary School Diploma
domain includes: Specialist Degree
domain includes: Technical Level 1 Certificate
domain includes: Technical Level 2 Certificate
domain includes: Technical Level 3 Certificate
domain includes: Work-Based Learning Certificate
range includes: Assessment Component
range includes: Basic Component
range includes: Cocurricular Component
range includes: Collection Component
range includes: Collection Member
range includes: Competency Component
range includes: Course Component
range includes: Credential Component
range includes: Extracurricular Component
range includes: Job Component
range includes: Multi Component
range includes: Work Experience Component

Has Rubric
type: Property
comment: Rubric related to this resource.
term status: unstable
domain includes: Academic Certificate
domain includes: Apprentice Certificate
domain includes: Assessment Profile
domain includes: Associate Degree
domain includes: Associate of Applied Arts Degree
domain includes: Associate of Applied Science Degree
domain includes: Associate of Arts Degree
domain includes: Associate of Science Degree
domain includes: Bachelor's Degree
domain includes: Bachelor of Arts Degree
domain includes: Bachelor of Science Degree
domain includes: Badge
domain includes: Basic Technical Certificate
domain includes: Certificate
domain includes: Certificate of Completion
domain includes: Certificate of Participation
domain includes: Certification
domain includes: Course
domain includes: Credential
domain includes: Degree
domain includes: Digital Badge
domain includes: Diploma
domain includes: Doctoral Degree
domain includes: General Education Development (GED)
domain includes: General Education Level 1 Certificate
domain includes: General Education Level 2 Certificate
domain includes: Higher Education Level 1 Certificate
domain includes: Higher Education Level 2 Certificate
domain includes: Job
domain includes: Journeyman Certificate
domain includes: Learning Opportunity Profile
domain includes: Learning Program
domain includes: License
domain includes: Master Trade Certificate
domain includes: Master's Degree
domain includes: Master of Arts Degree
domain includes: Master of Science Degree
domain includes: Micro-Credential
domain includes: Open Badge
domain includes: Post-Baccalaureate Certificate
domain includes: Post-Master Certificate
domain includes: Pre-Apprenticeship Certificate
domain includes: Professional Certificate
domain includes: Professional Doctorate
domain includes: Proficiency Certificate
domain includes: Quality Assurance Credential
domain includes: Research Doctorate
domain includes: Secondary Education Certificate
domain includes: Secondary School Diploma
domain includes: Specialist Degree
domain includes: Task
domain includes: Technical Level 1 Certificate
domain includes: Technical Level 2 Certificate
domain includes: Technical Level 3 Certificate
domain includes: Work-Based Learning Certificate
range includes: Rubric

Has Specialization
type: Property
comment: More specialized profession, trade, or career field that is encompassed by the one being described.
term status: stable
domain includes: Occupation
range includes: Occupation

Has Specific Service
type: Property
comment: Support Service that is part of this Support Service.
term status: unstable
domain includes: Support Service
range includes: Support Service
inverse of: Is Specific Service Of

Has Statement
type: Property
comment: Alignment assertion belonging to the alignment map.
term status: stable
domain includes: Alignment Map
range includes: Statement

Has Structured Statement
type: Property
comment: Indicates contextualized data that reproduces or links to text such as part of a document or information about some aspect of a resource.
usage note: Do not use this property if a simple text property such as ceterms:description is adequate.
term status: unstable
sub property of: Has Part
domain includes: Evaluation Outcome
domain includes: Prior Learning Policy
domain includes: Transfer Agreement
range includes: Structured Statement

Has Sub-framework scheme
type: Property
comment: Indicates a Concept Scheme used to differentiate parts of a framework or related resources that are considered to be somewhat independent.
description: Examples include differentiating those progression levels or credential types that are relevant to different sectors, such as General Education, Higher Education and Technical / Vocational Education and Training.
term status: unstable
domain includes: Qualifications Framework
range includes: ConceptScheme

Has Support Service
type: Property
comment: Reference to a relevant support service.
term status: unstable
domain includes: Academic Certificate
domain includes: Apprentice Certificate
domain includes: Assessment Profile
domain includes: Associate Degree
domain includes: Associate of Applied Arts Degree
domain includes: Associate of Applied Science Degree
domain includes: Associate of Arts Degree
domain includes: Associate of Science Degree
domain includes: Bachelor's Degree
domain includes: Bachelor of Arts Degree
domain includes: Bachelor of Science Degree
domain includes: Badge
domain includes: Basic Technical Certificate
domain includes: Certificate
domain includes: Certificate of Completion
domain includes: Certificate of Participation
domain includes: Certification
domain includes: Collection
domain includes: Course
domain includes: Credential
domain includes: Degree
domain includes: Digital Badge
domain includes: Diploma
domain includes: Doctoral Degree
domain includes: General Education Development (GED)
domain includes: General Education Level 1 Certificate
domain includes: General Education Level 2 Certificate
domain includes: Higher Education Level 1 Certificate
domain includes: Higher Education Level 2 Certificate
domain includes: Job
domain includes: Journeyman Certificate
domain includes: Learning Opportunity Profile
domain includes: Learning Program
domain includes: License
domain includes: Master Trade Certificate
domain includes: Master's Degree
domain includes: Master of Arts Degree
domain includes: Master of Science Degree
domain includes: Micro-Credential
domain includes: Open Badge
domain includes: Pathway
domain includes: Post-Baccalaureate Certificate
domain includes: Post-Master Certificate
domain includes: Pre-Apprenticeship Certificate
domain includes: Prior Learning Policy
domain includes: Professional Certificate
domain includes: Professional Doctorate
domain includes: Proficiency Certificate
domain includes: Quality Assurance Credential
domain includes: Research Doctorate
domain includes: Scheduled Offering
domain includes: Secondary Education Certificate
domain includes: Secondary School Diploma
domain includes: Specialist Degree
domain includes: Technical Level 1 Certificate
domain includes: Technical Level 2 Certificate
domain includes: Technical Level 3 Certificate
domain includes: Transfer Agreement
domain includes: Work-Based Learning Certificate
domain includes: Work Role
range includes: Support Service

Has Task
type: Property
comment: Task related to this resource.
term status: stable
domain includes: Competency
domain includes: Job
domain includes: Occupation
domain includes: Work Role
range includes: Task

Has Transfer Value Profile
type: Property
comment: Description of transfer value that is part of this resource.
term status: unstable
sub property of: Has Part
domain includes: Transfer Agreement
range includes: Transfer Value Profile

Has Verification Service
type: Property
comment: Entity describing available systems provided by the agent to verify credential holders.
description: Systems in place to verify credential holders and communicate the current credentialing status of all credential holders to employers and other labor market participants, as well as to education and workforce development funders and regulators.
term status: stable
domain includes: Credential Organization
domain includes: Organization
domain includes: QA Credential Organization
range includes: Verification Service Profile

Has Workforce Demand
type: Property
comment: Indicates the level of demand for a resource via a demand level action.
term status: unstable
sub property of: Related Action
domain includes: Competency
domain includes: Occupation
range includes: Workforce Demand Action

Has Work Role
type: Property
comment: Work Role related to this resource.
term status: stable
domain includes: Job
domain includes: Occupation
domain includes: Task
range includes: Work Role

High Earnings
type: Property
comment: Upper interquartile earnings.
term status: stable
domain includes: Aggregate Data Profile
domain includes: Earnings Profile
range includes: decimal
range includes: integer

Holder Must Authorize
type: Property
comment: Whether or not the credential holder must authorize the organization to provide the verification service.
term status: stable
domain includes: Verification Service Profile
range includes: boolean

Holders
type: Property
comment: Entity describing the number and characteristics of credentialed individuals and their geographic location.
usage note: The use of ceterms:aggregateData instead of this property is strongly recommended.
term status: stable
sub property of: Aggregate Data
domain includes: Academic Certificate
domain includes: Apprentice Certificate
domain includes: Associate Degree
domain includes: Associate of Applied Arts Degree
domain includes: Associate of Applied Science Degree
domain includes: Associate of Arts Degree
domain includes: Associate of Science Degree
domain includes: Bachelor's Degree
domain includes: Bachelor of Arts Degree
domain includes: Bachelor of Science Degree
domain includes: Badge
domain includes: Basic Technical Certificate
domain includes: Certificate
domain includes: Certificate of Completion
domain includes: Certificate of Participation
domain includes: Certification
domain includes: Credential
domain includes: Degree
domain includes: Digital Badge
domain includes: Diploma
domain includes: Doctoral Degree
domain includes: General Education Development (GED)
domain includes: General Education Level 1 Certificate
domain includes: General Education Level 2 Certificate
domain includes: Higher Education Level 1 Certificate
domain includes: Higher Education Level 2 Certificate
domain includes: Journeyman Certificate
domain includes: License
domain includes: Master Trade Certificate
domain includes: Master's Degree
domain includes: Master of Arts Degree
domain includes: Master of Science Degree
domain includes: Micro-Credential
domain includes: Open Badge
domain includes: Post-Baccalaureate Certificate
domain includes: Post-Master Certificate
domain includes: Pre-Apprenticeship Certificate
domain includes: Professional Certificate
domain includes: Professional Doctorate
domain includes: Proficiency Certificate
domain includes: Quality Assurance Credential
domain includes: Research Doctorate
domain includes: Secondary Education Certificate
domain includes: Secondary School Diploma
domain includes: Specialist Degree
domain includes: Technical Level 1 Certificate
domain includes: Technical Level 2 Certificate
domain includes: Technical Level 3 Certificate
domain includes: Work-Based Learning Certificate
range includes: Holders Profile

Honorific Suffix
type: Property
comment: Honorific suffix preceding a person's name such as M.D. , PhD, or MSCSW.
term status: stable
domain includes: CredentialPerson
range includes: langString
equivalent property: Contact Point

Identifier
type: Property
comment: Alphanumeric token that identifies this resource and information about the token's originating context or scheme.
usage note: Where a specific property for the originating context or scheme exists, such as ceterms:opeID, ceterms:ncesID, ceterms:leiCode, etc., use that property instead of this one. Where the identifier has no nameable originating context or scheme other than that of the resource being identified, ceterms:codedNotation may be used.
term status: stable
domain includes: Rubric
domain includes: Academic Certificate
domain includes: Alignment Map
domain includes: Apprentice Certificate
domain includes: Assessment Component
domain includes: Assessment Profile
domain includes: Associate Degree
domain includes: Associate of Applied Arts Degree
domain includes: Associate of Applied Science Degree
domain includes: Associate of Arts Degree
domain includes: Associate of Science Degree
domain includes: Bachelor's Degree
domain includes: Bachelor of Arts Degree
domain includes: Bachelor of Science Degree
domain includes: Badge
domain includes: Basic Component
domain includes: Basic Technical Certificate
domain includes: Certificate
domain includes: Certificate of Completion
domain includes: Certificate of Participation
domain includes: Certification
domain includes: Cocurricular Component
domain includes: Collection Component
domain includes: Competency Component
domain includes: Course
domain includes: Course Component
domain includes: Credential
domain includes: Credential Component
domain includes: Credential Organization
domain includes: Credential Type
domain includes: Degree
domain includes: Digital Badge
domain includes: Diploma
domain includes: Doctoral Degree
domain includes: Extracurricular Component
domain includes: General Education Development (GED)
domain includes: General Education Level 1 Certificate
domain includes: General Education Level 2 Certificate
domain includes: Higher Education Level 1 Certificate
domain includes: Higher Education Level 2 Certificate
domain includes: Industry
domain includes: Job
domain includes: Job Component
domain includes: Journeyman Certificate
domain includes: Learning Opportunity Profile
domain includes: Learning Program
domain includes: License
domain includes: Master Trade Certificate
domain includes: Master's Degree
domain includes: Master of Arts Degree
domain includes: Master of Science Degree
domain includes: Micro-Credential
domain includes: Multi Component
domain includes: Occupation
domain includes: Open Badge
domain includes: Organization
domain includes: Place
domain includes: Post-Baccalaureate Certificate
domain includes: Post-Master Certificate
domain includes: Pre-Apprenticeship Certificate
domain includes: Prior Learning Policy
domain includes: Professional Certificate
domain includes: Professional Doctorate
domain includes: Proficiency Certificate
domain includes: QA Credential Organization
domain includes: Qualifications Framework
domain includes: Quality Assurance Credential
domain includes: Research Doctorate
domain includes: Secondary Education Certificate
domain includes: Secondary School Diploma
domain includes: Specialist Degree
domain includes: Support Service
domain includes: Task
domain includes: Technical Level 1 Certificate
domain includes: Technical Level 2 Certificate

Identifier Type
type: Property
comment: Framework, scheme, type, or other organizing principle of this identifier.
term status: stable
domain includes: Identifier Value
range includes: anyURI

Identifier Type Name
type: Property
comment: Formal name or acronym of the framework, scheme, type, or other organizing principle of this identifier, such as ISBN or ISSN.
term status: stable
domain includes: Identifier Value
range includes: langString

Identifier Value Code
type: Property
comment: Alphanumeric string identifier of the entity.
description: Where a formal identification system exists for the identifier, recommended best practice is to use a string conforming to that system.
term status: stable
domain includes: Identifier Value
range includes: string

Image
type: Property
comment: Image, icon or logo that represents the entity including registered trade or service marks.
term status: stable
domain includes: Academic Certificate
domain includes: Alignment Map
domain includes: Apprentice Certificate
domain includes: Associate Degree
domain includes: Associate of Applied Arts Degree
domain includes: Associate of Applied Science Degree
domain includes: Associate of Arts Degree
domain includes: Associate of Science Degree
domain includes: Bachelor's Degree
domain includes: Bachelor of Arts Degree
domain includes: Bachelor of Science Degree
domain includes: Badge
domain includes: Basic Technical Certificate
domain includes: Certificate
domain includes: Certificate of Completion
domain includes: Certificate of Participation
domain includes: Certification
domain includes: Collection
domain includes: Credential
domain includes: Credential Organization
domain includes: Credential Type
domain includes: Degree
domain includes: Digital Badge
domain includes: Diploma
domain includes: Doctoral Degree
domain includes: General Education Development (GED)
domain includes: General Education Level 1 Certificate
domain includes: General Education Level 2 Certificate
domain includes: Higher Education Level 1 Certificate
domain includes: Higher Education Level 2 Certificate
domain includes: Journeyman Certificate
domain includes: License
domain includes: Master Trade Certificate
domain includes: Master's Degree
domain includes: Master of Arts Degree
domain includes: Master of Science Degree
domain includes: Micro-Credential
domain includes: Open Badge
domain includes: Organization
domain includes: Post-Baccalaureate Certificate
domain includes: Post-Master Certificate
domain includes: Pre-Apprenticeship Certificate
domain includes: Prior Learning Policy
domain includes: Professional Certificate
domain includes: Professional Doctorate
domain includes: Proficiency Certificate
domain includes: QA Credential Organization
domain includes: Qualifications Framework
domain includes: Quality Assurance Credential
domain includes: Research Doctorate
domain includes: Secondary Education Certificate
domain includes: Secondary School Diploma
domain includes: Specialist Degree
domain includes: Technical Level 1 Certificate
domain includes: Technical Level 2 Certificate
domain includes: Technical Level 3 Certificate
domain includes: Transfer Agreement
domain includes: Work-Based Learning Certificate
range includes: anyURI
equivalent property: image

In Alignment Map
type: Property
comment: Alignment map to which the statement belongs.
term status: stable
domain includes: Statement
range includes: Alignment Map

In Catalog
type: Property
comment: An inventory or listing of resources that includes this resource.
term status: unstable
domain includes: Rubric
domain includes: Academic Certificate
domain includes: Apprentice Certificate
domain includes: Assessment Profile
domain includes: Associate Degree
domain includes: Associate of Applied Arts Degree
domain includes: Associate of Applied Science Degree
domain includes: Associate of Arts Degree
domain includes: Associate of Science Degree
domain includes: Bachelor's Degree
domain includes: Bachelor of Arts Degree
domain includes: Bachelor of Science Degree
domain includes: Badge
domain includes: Basic Technical Certificate
domain includes: Certificate
domain includes: Certificate of Completion
domain includes: Certificate of Participation
domain includes: Certification
domain includes: Collection
domain includes: Course
domain includes: Credential
domain includes: Credential Type
domain includes: Degree
domain includes: Digital Badge
domain includes: Diploma
domain includes: Doctoral Degree
domain includes: General Education Development (GED)
domain includes: General Education Level 1 Certificate
domain includes: General Education Level 2 Certificate
domain includes: Higher Education Level 1 Certificate
domain includes: Higher Education Level 2 Certificate
domain includes: Industry
domain includes: Job
domain includes: Journeyman Certificate
domain includes: Learning Opportunity Profile
domain includes: Learning Program
domain includes: License
domain includes: Master Trade Certificate
domain includes: Master's Degree
domain includes: Master of Arts Degree
domain includes: Master of Science Degree
domain includes: Micro-Credential
domain includes: Occupation
domain includes: Open Badge
domain includes: Post-Baccalaureate Certificate
domain includes: Post-Master Certificate
domain includes: Pre-Apprenticeship Certificate
domain includes: Professional Certificate
domain includes: Professional Doctorate
domain includes: Proficiency Certificate
domain includes: Quality Assurance Credential
domain includes: Research Doctorate
domain includes: Secondary Education Certificate
domain includes: Secondary School Diploma
domain includes: Specialist Degree
domain includes: Task
domain includes: Technical Level 1 Certificate
domain includes: Technical Level 2 Certificate
domain includes: Technical Level 3 Certificate
domain includes: Transfer Intermediary
domain includes: Transfer Value Profile
domain includes: Work-Based Learning Certificate
domain includes: Work Role
range includes: anyURI

In Demand Action
type: Property
comment: Assertion by an agent that this resource has a specific workforce demand level.
term status: unstable
sub property of: Related Action
domain includes: Credential Organization
domain includes: Organization
domain includes: QA Credential Organization
range includes: Workforce Demand Action

Indicative Credential Type
type: Property
comment: Category or class of credential that is typical for a level in a qualifications framework or similar progression model.
term status: unstable
domain includes: ProgressionLevel
range includes: Credential Type

Industry Type
type: Property
comment: Type of industry; select from an existing enumeration of such types such as the SIC, NAICS, and ISIC classifications.
usage note: Best practice in identifying industries for U.S. resources is to provide the NAICS code using the ceterms:naics property. Other resources may use the ceterms:industrytype property and any framework of the class ceterms:IndustryClassification.
term status: stable
sub property of: credentialAlignment
domain includes: Competency
domain includes: CompetencyFramework
domain includes: Rubric
domain includes: Academic Certificate
domain includes: Apprentice Certificate
domain includes: Assessment Profile
domain includes: Associate Degree
domain includes: Associate of Applied Arts Degree
domain includes: Associate of Applied Science Degree
domain includes: Associate of Arts Degree
domain includes: Associate of Science Degree
domain includes: Bachelor's Degree
domain includes: Bachelor of Arts Degree
domain includes: Bachelor of Science Degree
domain includes: Badge
domain includes: Basic Technical Certificate
domain includes: Certificate
domain includes: Certificate of Completion
domain includes: Certificate of Participation
domain includes: Certification
domain includes: Collection
domain includes: Course
domain includes: Credential
domain includes: Credential Organization
domain includes: Credential Type
domain includes: Degree
domain includes: Digital Badge
domain includes: Diploma
domain includes: Doctoral Degree
domain includes: General Education Development (GED)
domain includes: General Education Level 1 Certificate
domain includes: General Education Level 2 Certificate
domain includes: Higher Education Level 1 Certificate
domain includes: Higher Education Level 2 Certificate
domain includes: Industry
domain includes: Job
domain includes: Job Component
domain includes: Journeyman Certificate
domain includes: Learning Opportunity Profile
domain includes: Learning Program
domain includes: License
domain includes: Master Trade Certificate
domain includes: Master's Degree
domain includes: Master of Arts Degree
domain includes: Master of Science Degree
domain includes: Micro-Credential
domain includes: Occupation
domain includes: Open Badge
domain includes: Organization
domain includes: Pathway
domain includes: Post-Baccalaureate Certificate
domain includes: Post-Master Certificate
domain includes: Pre-Apprenticeship Certificate
domain includes: Professional Certificate
domain includes: Professional Doctorate
domain includes: Proficiency Certificate
domain includes: QA Credential Organization
domain includes: Quality Assurance Credential
domain includes: Research Doctorate
domain includes: Secondary Education Certificate
domain includes: Secondary School Diploma
domain includes: Specialist Degree
domain includes: Technical Level 1 Certificate
domain includes: Technical Level 2 Certificate
domain includes: Technical Level 3 Certificate
domain includes: Work-Based Learning Certificate
range includes: Credential Alignment Object

In Language
type: Property
comment: The primary language or languages of the entity, even if it makes use of other languages.
usage note: A course offered in English to teach Spanish would have an inLanguage of English, while a credential in Quebec could have an inLanguage of both French and English.
term status: stable
domain includes: Academic Certificate
domain includes: Alignment Map
domain includes: Apprentice Certificate
domain includes: Assessment Profile
domain includes: Associate Degree
domain includes: Associate of Applied Arts Degree
domain includes: Associate of Applied Science Degree
domain includes: Associate of Arts Degree
domain includes: Associate of Science Degree
domain includes: Bachelor's Degree
domain includes: Bachelor of Arts Degree
domain includes: Bachelor of Science Degree
domain includes: Badge
domain includes: Basic Technical Certificate
domain includes: Certificate
domain includes: Certificate of Completion
domain includes: Certificate of Participation
domain includes: Certification
domain includes: Collection
domain includes: Course
domain includes: Credential
domain includes: Credential Type
domain includes: Degree
domain includes: Digital Badge
domain includes: Diploma
domain includes: Doctoral Degree
domain includes: General Education Development (GED)
domain includes: General Education Level 1 Certificate
domain includes: General Education Level 2 Certificate
domain includes: Higher Education Level 1 Certificate
domain includes: Higher Education Level 2 Certificate
domain includes: Journeyman Certificate
domain includes: Learning Opportunity Profile
domain includes: Learning Program
domain includes: License
domain includes: Master Trade Certificate
domain includes: Master's Degree
domain includes: Master of Arts Degree
domain includes: Master of Science Degree
domain includes: Micro-Credential
domain includes: Open Badge
domain includes: Post-Baccalaureate Certificate
domain includes: Post-Master Certificate
domain includes: Pre-Apprenticeship Certificate
domain includes: Prior Learning Policy
domain includes: Professional Certificate
domain includes: Professional Doctorate
domain includes: Proficiency Certificate
domain includes: Qualifications Framework
domain includes: Quality Assurance Credential
domain includes: Research Doctorate
domain includes: Secondary Education Certificate
domain includes: Secondary School Diploma
domain includes: Specialist Degree
domain includes: Support Service
domain includes: Technical Level 1 Certificate
domain includes: Technical Level 2 Certificate
domain includes: Technical Level 3 Certificate
domain includes: Transfer Agreement
domain includes: Work-Based Learning Certificate
range includes: language
equivalent property: inLanguage

In Qualifications Framework
type: Property
comment: Indicates a Qualifications Framework that uses this resource.
term status: unstable
domain includes: ProgressionModel
range includes: Qualifications Framework

Instructional Program Type
type: Property
comment: Type of instructional program; select from an existing enumeration of such types.
usage note: For U.S. credentials, best practice is to use a framework such as the CIP (Classification of Instructional Programs). Other credentials may use any framework of the class CTDL InstructionalProgramClassification.
term status: stable
sub property of: credentialAlignment
domain includes: Competency
domain includes: CompetencyFramework
domain includes: Rubric
domain includes: Academic Certificate
domain includes: Apprentice Certificate
domain includes: Assessment Profile
domain includes: Associate Degree
domain includes: Associate of Applied Arts Degree
domain includes: Associate of Applied Science Degree
domain includes: Associate of Arts Degree
domain includes: Associate of Science Degree
domain includes: Bachelor's Degree
domain includes: Bachelor of Arts Degree
domain includes: Bachelor of Science Degree
domain includes: Badge
domain includes: Basic Technical Certificate
domain includes: Certificate
domain includes: Certificate of Completion
domain includes: Certificate of Participation
domain includes: Certification
domain includes: Collection
domain includes: Course
domain includes: Credential
domain includes: Degree
domain includes: Digital Badge
domain includes: Diploma
domain includes: Doctoral Degree
domain includes: General Education Development (GED)
domain includes: General Education Level 1 Certificate
domain includes: General Education Level 2 Certificate
domain includes: Higher Education Level 1 Certificate
domain includes: Higher Education Level 2 Certificate
domain includes: Journeyman Certificate
domain includes: Learning Opportunity Profile
domain includes: Learning Program
domain includes: License
domain includes: Master Trade Certificate
domain includes: Master's Degree
domain includes: Master of Arts Degree
domain includes: Master of Science Degree
domain includes: Micro-Credential
domain includes: Open Badge
domain includes: Pathway
domain includes: Post-Baccalaureate Certificate
domain includes: Post-Master Certificate
domain includes: Pre-Apprenticeship Certificate
domain includes: Professional Certificate
domain includes: Professional Doctorate
domain includes: Proficiency Certificate
domain includes: Quality Assurance Credential
domain includes: Research Doctorate
domain includes: Secondary Education Certificate
domain includes: Secondary School Diploma
domain includes: Specialist Degree
domain includes: Technical Level 1 Certificate
domain includes: Technical Level 2 Certificate
domain includes: Technical Level 3 Certificate
domain includes: Work-Based Learning Certificate
domain includes: DataSetProfile
range includes: Credential Alignment Object
range includes: Concept

Instrument
type: Property
comment: Object that helped the agent perform the action. e.g. John wrote a book with a pen.
description: A credential or other instrument whose criteria was applied in executing the action.
term status: stable
domain includes: Accredit Action
domain includes: Advanced Standing Action
domain includes: Approve Action
domain includes: Credentialing Action
domain includes: Offer Action
domain includes: Process Profile
domain includes: Recognize Action
domain includes: Registration Action
domain includes: Regulate Action
domain includes: Renew Action
domain includes: Revoke Action
domain includes: Rights Action
domain includes: Workforce Demand Action
range includes: Rubric
range includes: Academic Certificate
range includes: Apprentice Certificate
range includes: Associate Degree
range includes: Associate of Applied Arts Degree
range includes: Associate of Applied Science Degree
range includes: Associate of Arts Degree
range includes: Associate of Science Degree
range includes: Bachelor's Degree
range includes: Bachelor of Arts Degree
range includes: Bachelor of Science Degree
range includes: Badge
range includes: Basic Technical Certificate
range includes: Certificate
range includes: Certificate of Completion
range includes: Certificate of Participation
range includes: Certification
range includes: Credential
range includes: Degree
range includes: Digital Badge
range includes: Diploma
range includes: Doctoral Degree
range includes: General Education Development (GED)
range includes: General Education Level 1 Certificate
range includes: General Education Level 2 Certificate
range includes: Higher Education Level 1 Certificate
range includes: Higher Education Level 2 Certificate
range includes: Journeyman Certificate
range includes: License
range includes: Master Trade Certificate
range includes: Master's Degree
range includes: Master of Arts Degree
range includes: Master of Science Degree
range includes: Micro-Credential
range includes: Open Badge
range includes: Post-Baccalaureate Certificate
range includes: Post-Master Certificate
range includes: Pre-Apprenticeship Certificate
range includes: Professional Certificate
range includes: Professional Doctorate
range includes: Proficiency Certificate
range includes: Quality Assurance Credential
range includes: Research Doctorate
range includes: Secondary Education Certificate
range includes: Secondary School Diploma
range includes: Specialist Degree
range includes: Technical Level 1 Certificate
range includes: Technical Level 2 Certificate
range includes: Technical Level 3 Certificate
range includes: Work-Based Learning Certificate
equivalent property: instrument

Intermediary For
type: Property
comment: Resource for which this resource is an intermediary.
term status: unstable
domain includes: Transfer Intermediary
range includes: Transfer Value Profile

IPEDS ID
type: Property
comment: Unique six digit identifier assigned to all U.S. institutions that have submitted data to the Integrated Postsecondary Education Data System (IPEDS).
term status: stable
domain includes: Credential Organization
domain includes: Organization
domain includes: QA Credential Organization
range includes: string

Is Advanced Standing For
type: Property
comment: This resource reduces the time or cost required to earn or complete the referenced resource.
usage note: A third-party credential agent claiming that its credential provides advanced standing for the credential of another credential agent should consider using ceterms:recommendedFor instead of ceterms:advancedStandingFor in the absence of an explicit and verifiable agreement on advanced standing between the agents of the two credentials.
term status: stable
domain includes: Academic Certificate
domain includes: Apprentice Certificate
domain includes: Assessment Profile
domain includes: Associate Degree
domain includes: Associate of Applied Arts Degree
domain includes: Associate of Applied Science Degree
domain includes: Associate of Arts Degree
domain includes: Associate of Science Degree
domain includes: Bachelor's Degree
domain includes: Bachelor of Arts Degree
domain includes: Bachelor of Science Degree
domain includes: Badge
domain includes: Basic Technical Certificate
domain includes: Certificate
domain includes: Certificate of Completion
domain includes: Certificate of Participation
domain includes: Certification
domain includes: Course
domain includes: Credential
domain includes: Degree
domain includes: Digital Badge
domain includes: Diploma
domain includes: Doctoral Degree
domain includes: General Education Development (GED)
domain includes: General Education Level 1 Certificate
domain includes: General Education Level 2 Certificate
domain includes: Higher Education Level 1 Certificate
domain includes: Higher Education Level 2 Certificate
domain includes: Journeyman Certificate
domain includes: Learning Opportunity Profile
domain includes: Learning Program
domain includes: License
domain includes: Master Trade Certificate
domain includes: Master's Degree
domain includes: Master of Arts Degree
domain includes: Master of Science Degree
domain includes: Micro-Credential
domain includes: Open Badge
domain includes: Post-Baccalaureate Certificate
domain includes: Post-Master Certificate
domain includes: Pre-Apprenticeship Certificate
domain includes: Professional Certificate
domain includes: Professional Doctorate
domain includes: Proficiency Certificate
domain includes: Quality Assurance Credential
domain includes: Research Doctorate
domain includes: Secondary Education Certificate
domain includes: Secondary School Diploma
domain includes: Specialist Degree
domain includes: Technical Level 1 Certificate
domain includes: Technical Level 2 Certificate
domain includes: Technical Level 3 Certificate
domain includes: Work-Based Learning Certificate
range includes: Academic Certificate
range includes: Apprentice Certificate
range includes: Assessment Profile
range includes: Associate Degree
range includes: Associate of Applied Arts Degree
range includes: Associate of Applied Science Degree
range includes: Associate of Arts Degree
range includes: Associate of Science Degree
range includes: Bachelor's Degree
range includes: Bachelor of Arts Degree
range includes: Bachelor of Science Degree
range includes: Badge
range includes: Basic Technical Certificate
range includes: Certificate
range includes: Certificate of Completion
range includes: Certificate of Participation
range includes: Certification
range includes: Condition Profile
range includes: Course
range includes: Credential
range includes: Degree
range includes: Digital Badge

Is Destination Component Of
type: Property
comment: Pathway for which this resource is the goal or destination.
term status: stable
domain includes: Assessment Component
domain includes: Basic Component
domain includes: Cocurricular Component
domain includes: Collection Component
domain includes: Competency Component
domain includes: Course Component
domain includes: Credential Component
domain includes: Extracurricular Component
domain includes: Job Component
domain includes: Multi Component
domain includes: Work Experience Component
range includes: Pathway

Is Evaluation Of
type: Property
comment: The resource that was evaluated.
term status: unstable
domain includes: Evaluation Outcome
range includes: Transfer Value Profile

ISIC Revision 4 Code
type: Property
comment: The International Standard of Industrial Classification of All Economic Activities (ISIC), Revision 4 code for a particular organization, business person, or place.
term status: stable
domain includes: Academic Certificate
domain includes: Apprentice Certificate
domain includes: Associate Degree
domain includes: Associate of Applied Arts Degree
domain includes: Associate of Applied Science Degree
domain includes: Associate of Arts Degree
domain includes: Associate of Science Degree
domain includes: Bachelor's Degree
domain includes: Bachelor of Arts Degree
domain includes: Bachelor of Science Degree
domain includes: Badge
domain includes: Basic Technical Certificate
domain includes: Certificate
domain includes: Certificate of Completion
domain includes: Certificate of Participation
domain includes: Certification
domain includes: Credential
domain includes: Credential Organization
domain includes: Degree
domain includes: Digital Badge
domain includes: Diploma
domain includes: Doctoral Degree
domain includes: General Education Development (GED)
domain includes: General Education Level 1 Certificate
domain includes: General Education Level 2 Certificate
domain includes: Higher Education Level 1 Certificate
domain includes: Higher Education Level 2 Certificate
domain includes: Journeyman Certificate
domain includes: License
domain includes: Master Trade Certificate
domain includes: Master's Degree
domain includes: Master of Arts Degree
domain includes: Master of Science Degree
domain includes: Micro-Credential
domain includes: Open Badge
domain includes: Organization
domain includes: Post-Baccalaureate Certificate
domain includes: Post-Master Certificate
domain includes: Pre-Apprenticeship Certificate
domain includes: Professional Certificate
domain includes: Professional Doctorate
domain includes: Proficiency Certificate
domain includes: QA Credential Organization
domain includes: Quality Assurance Credential
domain includes: Research Doctorate
domain includes: Secondary Education Certificate
domain includes: Secondary School Diploma
domain includes: Specialist Degree
domain includes: Technical Level 1 Certificate
domain includes: Technical Level 2 Certificate
domain includes: Technical Level 3 Certificate
domain includes: Work-Based Learning Certificate
range includes: string
equivalent property: isicV4

Is Member Of
type: Property
comment: Collection to which this resource belongs.
term status: unstable
domain includes: Competency
domain includes: Course
domain includes: Industry
domain includes: Job
domain includes: Learning Opportunity Profile
domain includes: Learning Program
domain includes: Occupation
domain includes: Prior Learning Policy
domain includes: Task
domain includes: Transfer Agreement
domain includes: Transfer Value Profile
domain includes: Work Role
range includes: Collection

Is Non-Credit
type: Property
comment: Resource carries or confers no official academic credit according to the provider of the resource.
term status: unstable
domain includes: Academic Certificate
domain includes: Apprentice Certificate
domain includes: Assessment Profile
domain includes: Badge
domain includes: Basic Technical Certificate
domain includes: Certificate
domain includes: Certificate of Completion
domain includes: Certificate of Participation
domain includes: Certification
domain includes: Course
domain includes: Digital Badge
domain includes: Diploma
domain includes: Journeyman Certificate
domain includes: Learning Opportunity Profile
domain includes: Learning Program
domain includes: License
domain includes: Master Trade Certificate
domain includes: Micro-Credential
domain includes: Open Badge
domain includes: Pre-Apprenticeship Certificate
domain includes: Professional Certificate
domain includes: Proficiency Certificate
domain includes: Secondary Education Certificate
domain includes: Work-Based Learning Certificate
range includes: boolean

Is Part Of
type: Property
comment: Indicates another entity of which this entity is a component.
description: Covers partitive notions such as "embedded".
term status: stable
domain includes: Academic Certificate
domain includes: Alignment Object
domain includes: Apprentice Certificate
domain includes: Assessment Component
domain includes: Associate Degree
domain includes: Associate of Applied Arts Degree
domain includes: Associate of Applied Science Degree
domain includes: Associate of Arts Degree
domain includes: Associate of Science Degree
domain includes: Bachelor's Degree
domain includes: Bachelor of Arts Degree
domain includes: Bachelor of Science Degree
domain includes: Badge
domain includes: Basic Component
domain includes: Basic Technical Certificate
domain includes: Certificate
domain includes: Certificate of Completion
domain includes: Certificate of Participation
domain includes: Certification
domain includes: Cocurricular Component
domain includes: Collection Component
domain includes: Competency Component
domain includes: Course
domain includes: Course Component
domain includes: Credential
domain includes: Credential Component
domain includes: Degree
domain includes: Digital Badge
domain includes: Diploma
domain includes: Doctoral Degree
domain includes: Extracurricular Component
domain includes: General Education Development (GED)
domain includes: General Education Level 1 Certificate
domain includes: General Education Level 2 Certificate
domain includes: Higher Education Level 1 Certificate
domain includes: Higher Education Level 2 Certificate
domain includes: Job Component
domain includes: Journeyman Certificate
domain includes: Learning Opportunity Profile
domain includes: Learning Program
domain includes: License
domain includes: Master Trade Certificate
domain includes: Master's Degree
domain includes: Master of Arts Degree
domain includes: Master of Science Degree
domain includes: Micro-Credential
domain includes: Multi Component
domain includes: Open Badge
domain includes: Post-Baccalaureate Certificate
domain includes: Post-Master Certificate
domain includes: Pre-Apprenticeship Certificate
domain includes: Prior Learning Policy
domain includes: Professional Certificate
domain includes: Professional Doctorate
domain includes: Proficiency Certificate
domain includes: Quality Assurance Credential
domain includes: Research Doctorate
domain includes: Secondary Education Certificate
domain includes: Secondary School Diploma
domain includes: Specialist Degree
domain includes: Technical Level 1 Certificate
domain includes: Technical Level 2 Certificate
domain includes: Technical Level 3 Certificate
domain includes: Work-Based Learning Certificate
domain includes: Work Experience Component
range includes: Academic Certificate
range includes: Alignment Map
range includes: Apprentice Certificate
range includes: Associate Degree
range includes: Associate of Applied Arts Degree
range includes: Associate of Applied Science Degree
range includes: Associate of Arts Degree
range includes: Associate of Science Degree
range includes: Bachelor's Degree
range includes: Bachelor of Arts Degree

Is Preparation For
type: Property
comment: This resource provides preparation for the resource being referenced.
term status: stable
domain includes: Academic Certificate
domain includes: Apprentice Certificate
domain includes: Assessment Profile
domain includes: Associate Degree
domain includes: Associate of Applied Arts Degree
domain includes: Associate of Applied Science Degree
domain includes: Associate of Arts Degree
domain includes: Associate of Science Degree
domain includes: Bachelor's Degree
domain includes: Bachelor of Arts Degree
domain includes: Bachelor of Science Degree
domain includes: Badge
domain includes: Basic Technical Certificate
domain includes: Certificate
domain includes: Certificate of Completion
domain includes: Certificate of Participation
domain includes: Certification
domain includes: Course
domain includes: Credential
domain includes: Credential Type
domain includes: Degree
domain includes: Digital Badge
domain includes: Diploma
domain includes: Doctoral Degree
domain includes: General Education Development (GED)
domain includes: General Education Level 1 Certificate
domain includes: General Education Level 2 Certificate
domain includes: Higher Education Level 1 Certificate
domain includes: Higher Education Level 2 Certificate
domain includes: Journeyman Certificate
domain includes: Learning Opportunity Profile
domain includes: Learning Program
domain includes: License
domain includes: Master Trade Certificate
domain includes: Master's Degree
domain includes: Master of Arts Degree
domain includes: Master of Science Degree
domain includes: Micro-Credential
domain includes: Open Badge
domain includes: Post-Baccalaureate Certificate
domain includes: Post-Master Certificate
domain includes: Pre-Apprenticeship Certificate
domain includes: Professional Certificate
domain includes: Professional Doctorate
domain includes: Proficiency Certificate
domain includes: Quality Assurance Credential
domain includes: Research Doctorate
domain includes: Secondary Education Certificate
domain includes: Secondary School Diploma
domain includes: Specialist Degree
domain includes: Technical Level 1 Certificate
domain includes: Technical Level 2 Certificate
domain includes: Technical Level 3 Certificate
domain includes: Work-Based Learning Certificate
range includes: Academic Certificate
range includes: Apprentice Certificate
range includes: Assessment Profile
range includes: Associate Degree
range includes: Associate of Applied Arts Degree
range includes: Associate of Applied Science Degree
range includes: Associate of Arts Degree
range includes: Associate of Science Degree
range includes: Bachelor's Degree
range includes: Bachelor of Arts Degree
range includes: Bachelor of Science Degree
range includes: Badge
range includes: Basic Technical Certificate
range includes: Certificate
range includes: Certificate of Completion
range includes: Certificate of Participation
range includes: Certification
range includes: Condition Profile
range includes: Course
range includes: Credential
range includes: Credential Type
range includes: Degree

Is Proctored
type: Property
comment: Whether or not the assessment is supervised or monitored by an agent.
description: Such supervision or proctoring includes: (1) guaranteeing of the identities of the examinees; (2) the conditions of the examination including instructions, time, materials, equipment and completion, and (3) completed without unauthorized assistance.
term status: stable
domain includes: Assessment Profile
range includes: boolean

Is Recommended For
type: Property
comment: It is recommended to earn or complete this resource before attempting to earn or complete the referenced resource.
term status: stable
domain includes: Academic Certificate
domain includes: Apprentice Certificate
domain includes: Assessment Profile
domain includes: Associate Degree
domain includes: Associate of Applied Arts Degree
domain includes: Associate of Applied Science Degree
domain includes: Associate of Arts Degree
domain includes: Associate of Science Degree
domain includes: Bachelor's Degree
domain includes: Bachelor of Arts Degree
domain includes: Bachelor of Science Degree
domain includes: Badge
domain includes: Basic Technical Certificate
domain includes: Certificate
domain includes: Certificate of Completion
domain includes: Certificate of Participation
domain includes: Certification
domain includes: Course
domain includes: Credential
domain includes: Degree
domain includes: Digital Badge
domain includes: Diploma
domain includes: Doctoral Degree
domain includes: General Education Development (GED)
domain includes: General Education Level 1 Certificate
domain includes: General Education Level 2 Certificate
domain includes: Higher Education Level 1 Certificate
domain includes: Higher Education Level 2 Certificate
domain includes: Journeyman Certificate
domain includes: Learning Opportunity Profile
domain includes: Learning Program
domain includes: License
domain includes: Master Trade Certificate
domain includes: Master's Degree
domain includes: Master of Arts Degree
domain includes: Master of Science Degree
domain includes: Micro-Credential
domain includes: Open Badge
domain includes: Post-Baccalaureate Certificate
domain includes: Post-Master Certificate
domain includes: Pre-Apprenticeship Certificate
domain includes: Professional Certificate
domain includes: Professional Doctorate
domain includes: Proficiency Certificate
domain includes: Quality Assurance Credential
domain includes: Research Doctorate
domain includes: Secondary Education Certificate
domain includes: Secondary School Diploma
domain includes: Specialist Degree
domain includes: Technical Level 1 Certificate
domain includes: Technical Level 2 Certificate
domain includes: Technical Level 3 Certificate
domain includes: Work-Based Learning Certificate
range includes: Academic Certificate
range includes: Apprentice Certificate
range includes: Assessment Profile
range includes: Associate Degree
range includes: Associate of Applied Arts Degree
range includes: Associate of Applied Science Degree
range includes: Associate of Arts Degree
range includes: Associate of Science Degree
range includes: Bachelor's Degree
range includes: Bachelor of Arts Degree
range includes: Bachelor of Science Degree
range includes: Badge
range includes: Basic Technical Certificate
range includes: Certificate
range includes: Certificate of Completion
range includes: Certificate of Participation
range includes: Certification
range includes: Condition Profile
range includes: Course
range includes: Credential
range includes: Degree
range includes: Digital Badge
range includes: Diploma

Is Registered Apprenticeship
type: Property
comment: The resource is registered with a governmental agency or other authorized organization because it has been vetted, approved and validated to meet specific criteria.
term status: unstable
domain includes: Apprentice Certificate
domain includes: Course
domain includes: Journeyman Certificate
domain includes: Learning Opportunity Profile
domain includes: Learning Program
domain includes: Master Trade Certificate
domain includes: Pre-Apprenticeship Certificate
domain includes: Work-Based Learning Certificate
range includes: boolean

Is Required For
type: Property
comment: This resource must be earned or completed prior to attempting to earn or complete the referenced resource.
term status: stable
domain includes: Academic Certificate
domain includes: Apprentice Certificate
domain includes: Assessment Profile
domain includes: Associate Degree
domain includes: Associate of Applied Arts Degree
domain includes: Associate of Applied Science Degree
domain includes: Associate of Arts Degree
domain includes: Associate of Science Degree
domain includes: Bachelor's Degree
domain includes: Bachelor of Arts Degree
domain includes: Bachelor of Science Degree
domain includes: Badge
domain includes: Basic Technical Certificate
domain includes: Certificate
domain includes: Certificate of Completion
domain includes: Certificate of Participation
domain includes: Certification
domain includes: Course
domain includes: Credential
domain includes: Credential Type
domain includes: Degree
domain includes: Digital Badge
domain includes: Diploma
domain includes: Doctoral Degree
domain includes: General Education Development (GED)
domain includes: General Education Level 1 Certificate
domain includes: General Education Level 2 Certificate
domain includes: Higher Education Level 1 Certificate
domain includes: Higher Education Level 2 Certificate
domain includes: Journeyman Certificate
domain includes: Learning Opportunity Profile
domain includes: Learning Program
domain includes: License
domain includes: Master Trade Certificate
domain includes: Master's Degree
domain includes: Master of Arts Degree
domain includes: Master of Science Degree
domain includes: Micro-Credential
domain includes: Open Badge
domain includes: Post-Baccalaureate Certificate
domain includes: Post-Master Certificate
domain includes: Pre-Apprenticeship Certificate
domain includes: Professional Certificate
domain includes: Professional Doctorate
domain includes: Proficiency Certificate
domain includes: Quality Assurance Credential
domain includes: Research Doctorate
domain includes: Secondary Education Certificate
domain includes: Secondary School Diploma
domain includes: Specialist Degree
domain includes: Technical Level 1 Certificate
domain includes: Technical Level 2 Certificate
domain includes: Technical Level 3 Certificate
domain includes: Work-Based Learning Certificate
range includes: Academic Certificate
range includes: Apprentice Certificate
range includes: Assessment Profile
range includes: Associate Degree
range includes: Associate of Applied Arts Degree
range includes: Associate of Applied Science Degree
range includes: Associate of Arts Degree
range includes: Associate of Science Degree
range includes: Bachelor's Degree
range includes: Bachelor of Arts Degree
range includes: Bachelor of Science Degree
range includes: Badge
range includes: Basic Technical Certificate
range includes: Certificate
range includes: Certificate of Completion
range includes: Certificate of Participation
range includes: Certification
range includes: Condition Profile
range includes: Course
range includes: Credential
range includes: Credential Type
range includes: Degree

Is Similar To
type: Property
comment: Another functionally similar entity.
description: The property is generally applicable in describing the similarity between any two entities.
term status: stable
range includes: anyURI
equivalent property: isSimilarTo
equivalent property: related

Is Specialization Of
type: Property
comment: Less specialized profession, trade, or career field that encompasses the one being described.
term status: stable
domain includes: Occupation
range includes: Occupation

Is Specific Service Of
type: Property
comment: Support Service that is this Support Service is part of.
term status: unstable
domain includes: Support Service
range includes: Support Service
inverse of: Has Specific Service

Jobs Obtained
type: Property
comment: Number of jobs obtained in the region during a given timeframe.
term status: stable
domain includes: Aggregate Data Profile
domain includes: Employment Outcome Profile
range includes: Quantitative Value

Jurisdiction
type: Property
comment: Geographic or political region in which the resource is formally applicable or an organization has authority to act.
term status: stable
domain includes: Academic Certificate
domain includes: Aggregate Data Profile
domain includes: Alignment Map
domain includes: Apprentice Certificate
domain includes: Assessment Profile
domain includes: Associate Degree
domain includes: Associate of Applied Arts Degree
domain includes: Associate of Applied Science Degree
domain includes: Associate of Arts Degree
domain includes: Associate of Science Degree
domain includes: Bachelor's Degree
domain includes: Bachelor of Arts Degree
domain includes: Bachelor of Science Degree
domain includes: Badge
domain includes: Basic Technical Certificate
domain includes: Certificate
domain includes: Certificate of Completion
domain includes: Certificate of Participation
domain includes: Certification
domain includes: Condition Profile
domain includes: Cost Profile
domain includes: Course
domain includes: Credential
domain includes: Credential Organization
domain includes: Credential Type
domain includes: Degree
domain includes: Digital Badge
domain includes: Diploma
domain includes: Doctoral Degree
domain includes: Earnings Profile
domain includes: Employment Outcome Profile
domain includes: General Education Development (GED)
domain includes: General Education Level 1 Certificate
domain includes: General Education Level 2 Certificate
domain includes: Higher Education Level 1 Certificate
domain includes: Higher Education Level 2 Certificate
domain includes: Holders Profile
domain includes: Journeyman Certificate
domain includes: Learning Opportunity Profile
domain includes: Learning Program
domain includes: License
domain includes: Master Trade Certificate
domain includes: Master's Degree
domain includes: Master of Arts Degree
domain includes: Master of Science Degree
domain includes: Micro-Credential
domain includes: Open Badge
domain includes: Organization
domain includes: Post-Baccalaureate Certificate
domain includes: Post-Master Certificate
domain includes: Pre-Apprenticeship Certificate
domain includes: Prior Learning Policy
domain includes: Process Profile
domain includes: Professional Certificate
domain includes: Professional Doctorate
domain includes: Proficiency Certificate
domain includes: QA Credential Organization
domain includes: Qualifications Framework
domain includes: Quality Assurance Credential
domain includes: Research Doctorate
domain includes: Revocation Profile
domain includes: Secondary Education Certificate
domain includes: Secondary School Diploma
domain includes: Specialist Degree
domain includes: Technical Level 1 Certificate
domain includes: Technical Level 2 Certificate
domain includes: Technical Level 3 Certificate
domain includes: Transfer Agreement
domain includes: Verification Service Profile
domain includes: Work-Based Learning Certificate
domain includes: Workforce Demand Action
domain includes: DataSetProfile
range includes: Jurisdiction Profile

Jurisdiction Exception
type: Property
comment: Geographic or political region in which the credential is not formally recognized or an organization has no authority to act .
description: The ceterms:jurisdictionalException property is used in conjunction with the ceterms:jurisdiction property and expresses any exceptions to a more general statement; e.g., the United states except for Colorado.
term status: stable
sub property of: Spatial Coverage
domain includes: Jurisdiction Profile
range includes: Place

Keyword
type: Property
comment: Keyword or key phrase describing relevant aspects of an entity.
usage note: Use the keyword property to enter free text keywords. A subject concept in a controlled vocabulary should use the subject property.
term status: stable
sub property of: about
domain includes: Academic Certificate
domain includes: Alignment Map
domain includes: Apprentice Certificate
domain includes: Assessment Profile
domain includes: Associate Degree
domain includes: Associate of Applied Arts Degree
domain includes: Associate of Applied Science Degree
domain includes: Associate of Arts Degree
domain includes: Associate of Science Degree
domain includes: Bachelor's Degree
domain includes: Bachelor of Arts Degree
domain includes: Bachelor of Science Degree
domain includes: Badge
domain includes: Basic Technical Certificate
domain includes: Certificate
domain includes: Certificate of Completion
domain includes: Certificate of Participation
domain includes: Certification
domain includes: Collection
domain includes: Course
domain includes: Credential
domain includes: Credential Organization
domain includes: Credential Type
domain includes: Degree
domain includes: Digital Badge
domain includes: Diploma
domain includes: Doctoral Degree
domain includes: General Education Development (GED)
domain includes: General Education Level 1 Certificate
domain includes: General Education Level 2 Certificate
domain includes: Higher Education Level 1 Certificate
domain includes: Higher Education Level 2 Certificate
domain includes: Industry
domain includes: Job
domain includes: Journeyman Certificate
domain includes: Learning Opportunity Profile
domain includes: Learning Program
domain includes: License
domain includes: Master Trade Certificate
domain includes: Master's Degree
domain includes: Master of Arts Degree
domain includes: Master of Science Degree
domain includes: Micro-Credential
domain includes: Occupation
domain includes: Open Badge
domain includes: Organization
domain includes: Pathway
domain includes: Post-Baccalaureate Certificate
domain includes: Post-Master Certificate
domain includes: Pre-Apprenticeship Certificate
domain includes: Prior Learning Policy
domain includes: Professional Certificate
domain includes: Professional Doctorate
domain includes: Proficiency Certificate
domain includes: QA Credential Organization
domain includes: Qualifications Framework
domain includes: Quality Assurance Credential
domain includes: Research Doctorate
domain includes: Secondary Education Certificate
domain includes: Secondary School Diploma
domain includes: Specialist Degree
domain includes: Support Service
domain includes: Technical Level 1 Certificate
domain includes: Technical Level 2 Certificate
domain includes: Technical Level 3 Certificate
domain includes: Transfer Agreement
domain includes: Work-Based Learning Certificate
range includes: langString
equivalent property: conceptKeyword

Latest Version
type: Property
comment: Latest version of the resource.
term status: stable
domain includes: Competency
domain includes: CompetencyFramework
domain includes: Rubric
domain includes: Academic Certificate
domain includes: Alignment Map
domain includes: Apprentice Certificate
domain includes: Associate Degree
domain includes: Associate of Applied Arts Degree
domain includes: Associate of Applied Science Degree
domain includes: Associate of Arts Degree
domain includes: Associate of Science Degree
domain includes: Bachelor's Degree
domain includes: Bachelor of Arts Degree
domain includes: Bachelor of Science Degree
domain includes: Badge
domain includes: Basic Technical Certificate
domain includes: Certificate
domain includes: Certificate of Completion
domain includes: Certificate of Participation
domain includes: Certification
domain includes: Collection
domain includes: Credential
domain includes: Credential Type
domain includes: Degree
domain includes: Digital Badge
domain includes: Diploma
domain includes: Doctoral Degree
domain includes: General Education Development (GED)
domain includes: General Education Level 1 Certificate
domain includes: General Education Level 2 Certificate
domain includes: Higher Education Level 1 Certificate
domain includes: Higher Education Level 2 Certificate
domain includes: Journeyman Certificate
domain includes: License
domain includes: Master Trade Certificate
domain includes: Master's Degree
domain includes: Master of Arts Degree
domain includes: Master of Science Degree
domain includes: Micro-Credential
domain includes: Open Badge
domain includes: Pathway
domain includes: Post-Baccalaureate Certificate
domain includes: Post-Master Certificate
domain includes: Pre-Apprenticeship Certificate
domain includes: Prior Learning Policy
domain includes: Professional Certificate
domain includes: Professional Doctorate
domain includes: Proficiency Certificate
domain includes: Qualifications Framework
domain includes: Quality Assurance Credential
domain includes: Research Doctorate
domain includes: Secondary Education Certificate
domain includes: Secondary School Diploma
domain includes: Specialist Degree
domain includes: Technical Level 1 Certificate
domain includes: Technical Level 2 Certificate
domain includes: Technical Level 3 Certificate
domain includes: Transfer Agreement
domain includes: Transfer Value Profile
domain includes: Work-Based Learning Certificate
range includes: Academic Certificate
range includes: Alignment Map
range includes: Apprentice Certificate
range includes: Associate Degree
range includes: Associate of Applied Arts Degree
range includes: Associate of Applied Science Degree
range includes: Associate of Arts Degree
range includes: Associate of Science Degree
range includes: Bachelor's Degree
range includes: Bachelor of Arts Degree
range includes: Bachelor of Science Degree
range includes: Badge
range includes: Basic Technical Certificate
range includes: Certificate
range includes: Certificate of Completion
range includes: Certificate of Participation

Latitude
type: Property
comment: Latitude of a location.
description: For example 37.42242 (WGS 84)
term status: stable
domain includes: Geographic Coordinates
domain includes: Place
range includes: float
equivalent property: latitude

Learning Delivery Type
type: Property
comment: Delivery type for the learning opportunity for the credential.
description: Indicates the delivery type for the learning opportunity for the credential.
term status: stable
sub property of: Delivery Type
domain includes: Academic Certificate
domain includes: Apprentice Certificate
domain includes: Associate Degree
domain includes: Associate of Applied Arts Degree
domain includes: Associate of Applied Science Degree
domain includes: Associate of Arts Degree
domain includes: Associate of Science Degree
domain includes: Bachelor's Degree
domain includes: Bachelor of Arts Degree
domain includes: Bachelor of Science Degree
domain includes: Badge
domain includes: Basic Technical Certificate
domain includes: Certificate
domain includes: Certificate of Completion
domain includes: Certificate of Participation
domain includes: Certification
domain includes: Credential
domain includes: Degree
domain includes: Digital Badge
domain includes: Diploma
domain includes: Doctoral Degree
domain includes: General Education Development (GED)
domain includes: General Education Level 1 Certificate
domain includes: General Education Level 2 Certificate
domain includes: Higher Education Level 1 Certificate
domain includes: Higher Education Level 2 Certificate
domain includes: Journeyman Certificate
domain includes: License
domain includes: Master Trade Certificate
domain includes: Master's Degree
domain includes: Master of Arts Degree
domain includes: Master of Science Degree
domain includes: Micro-Credential
domain includes: Open Badge
domain includes: Post-Baccalaureate Certificate
domain includes: Post-Master Certificate
domain includes: Pre-Apprenticeship Certificate
domain includes: Professional Certificate
domain includes: Professional Doctorate
domain includes: Proficiency Certificate
domain includes: Quality Assurance Credential
domain includes: Research Doctorate
domain includes: Secondary Education Certificate
domain includes: Secondary School Diploma
domain includes: Specialist Degree
domain includes: Technical Level 1 Certificate
domain includes: Technical Level 2 Certificate
domain includes: Technical Level 3 Certificate
domain includes: Work-Based Learning Certificate
range includes: Credential Alignment Object

Learning Method Description
type: Property
comment: Description of the methods used to conduct learning.
term status: stable
domain includes: Academic Certificate
domain includes: Apprentice Certificate
domain includes: Assessment Profile
domain includes: Associate Degree
domain includes: Associate of Applied Arts Degree
domain includes: Associate of Applied Science Degree
domain includes: Associate of Arts Degree
domain includes: Associate of Science Degree
domain includes: Bachelor's Degree
domain includes: Bachelor of Arts Degree
domain includes: Bachelor of Science Degree
domain includes: Badge
domain includes: Basic Technical Certificate
domain includes: Certificate
domain includes: Certificate of Completion
domain includes: Certificate of Participation
domain includes: Certification
domain includes: Course
domain includes: Credential
domain includes: Degree
domain includes: Digital Badge
domain includes: Diploma
domain includes: Doctoral Degree
domain includes: General Education Development (GED)
domain includes: General Education Level 1 Certificate
domain includes: General Education Level 2 Certificate
domain includes: Higher Education Level 1 Certificate
domain includes: Higher Education Level 2 Certificate
domain includes: Journeyman Certificate
domain includes: Learning Opportunity Profile
domain includes: Learning Program
domain includes: License
domain includes: Master Trade Certificate
domain includes: Master's Degree
domain includes: Master of Arts Degree
domain includes: Master of Science Degree
domain includes: Micro-Credential
domain includes: Open Badge
domain includes: Post-Baccalaureate Certificate
domain includes: Post-Master Certificate
domain includes: Pre-Apprenticeship Certificate
domain includes: Professional Certificate
domain includes: Professional Doctorate
domain includes: Proficiency Certificate
domain includes: Quality Assurance Credential
domain includes: Research Doctorate
domain includes: Secondary Education Certificate
domain includes: Secondary School Diploma
domain includes: Specialist Degree
domain includes: Technical Level 1 Certificate
domain includes: Technical Level 2 Certificate
domain includes: Technical Level 3 Certificate
domain includes: Work-Based Learning Certificate
range includes: langString

Learning Method Type
type: Property
comment: Types of methods used to conduct the learning opportunity; select from an existing enumeration of such types.
usage note: Best practice is to use concepts from a controlled vocabulary such as the ceterms:LearningMethod.
term status: stable
domain includes: Academic Certificate
domain includes: Apprentice Certificate
domain includes: Assessment Profile
domain includes: Associate Degree
domain includes: Associate of Applied Arts Degree
domain includes: Associate of Applied Science Degree
domain includes: Associate of Arts Degree
domain includes: Associate of Science Degree
domain includes: Bachelor's Degree
domain includes: Bachelor of Arts Degree
domain includes: Bachelor of Science Degree
domain includes: Badge
domain includes: Basic Technical Certificate
domain includes: Certificate
domain includes: Certificate of Completion
domain includes: Certificate of Participation
domain includes: Certification
domain includes: Course
domain includes: Credential
domain includes: Degree
domain includes: Digital Badge
domain includes: Diploma
domain includes: Doctoral Degree
domain includes: General Education Development (GED)
domain includes: General Education Level 1 Certificate
domain includes: General Education Level 2 Certificate
domain includes: Higher Education Level 1 Certificate
domain includes: Higher Education Level 2 Certificate
domain includes: Journeyman Certificate
domain includes: Learning Opportunity Profile
domain includes: Learning Program
domain includes: License
domain includes: Master Trade Certificate
domain includes: Master's Degree
domain includes: Master of Arts Degree
domain includes: Master of Science Degree
domain includes: Micro-Credential
domain includes: Open Badge
domain includes: Post-Baccalaureate Certificate
domain includes: Post-Master Certificate
domain includes: Pre-Apprenticeship Certificate
domain includes: Professional Certificate
domain includes: Professional Doctorate
domain includes: Proficiency Certificate
domain includes: Quality Assurance Credential
domain includes: Research Doctorate
domain includes: Secondary Education Certificate
domain includes: Secondary School Diploma
domain includes: Specialist Degree
domain includes: Technical Level 1 Certificate
domain includes: Technical Level 2 Certificate
domain includes: Technical Level 3 Certificate
domain includes: Work-Based Learning Certificate
range includes: Credential Alignment Object

Learning Recognition Evidence Type
type: Property
comment: Type of prior learning evidence accepted for evaluation under the policy; select from an existing enumeration of such types.
term status: unstable
domain includes: Prior Learning Policy
domain includes: Transfer Agreement
range includes: Concept

Learning Recognition Method Type
type: Property
comment: Type of method used to evaluate and recognize prior learning; select from an existing enumeration of such types.
term status: unstable
domain includes: Prior Learning Policy
domain includes: Transfer Agreement
range includes: Concept

Learning Recognition Outcome Type
type: Property
comment: Type of outcome governed or permitted by the policy; select from an existing enumeration of such types.
term status: unstable
domain includes: Prior Learning Policy
domain includes: Transfer Agreement
range includes: Concept

Learning Recognition Source Type
type: Property
comment: Type of context from which prior learning may be recognized; select from an existing enumeration of such types.
term status: unstable
domain includes: Prior Learning Policy
domain includes: Transfer Agreement
range includes: Concept

Left Action
type: Property
comment: Action performed on the left source; select from an existing enumeration of such types.
term status: unstable
domain includes: Constraint
range includes: Concept

Left Source
type: Property
comment: Left hand parameter of a constraint.
term status: unstable
domain includes: Constraint
range includes: Property
range includes: Class
range includes: Literal
range includes: Concept

Legal Entity Identifier Code
type: Property
comment: A 20-digit, alpha-numeric code, based on the ISO 17442 standard, for identifying legal entities participating in financial transactions.
term status: stable
domain includes: Credential Organization
domain includes: Organization
domain includes: QA Credential Organization
range includes: string
equivalent property: leiCode

Life Cycle Status Type
type: Property
comment: Type of state of the resource in terms of its stage in a life cycle; select from an enumeration of such types.
term status: unstable
domain includes: Rubric
domain includes: Alignment Map
domain includes: Assessment Profile
domain includes: Collection
domain includes: Course
domain includes: Credential Organization
domain includes: Industry
domain includes: Job
domain includes: Learning Opportunity Profile
domain includes: Learning Program
domain includes: Occupation
domain includes: Organization
domain includes: Pathway
domain includes: QA Credential Organization
domain includes: Qualifications Framework
domain includes: Support Service
domain includes: Task
domain includes: Transfer Value Profile
domain includes: Work Role
range includes: Credential Alignment Object

Logical Operator
type: Property
comment: Type that denotes a logical operation such as "And", "Or", "OnlyOne"; select from an existing enumeration of such types.
description: Only a single instance of logicalOperator is allowed defining operations on two or more nested ComponentCondition entities, Constraint entities, or a mix of ComponentCondition and Constraint entities.
term status: unstable
range includes: Concept

Longitude
type: Property
comment: The longitude of a location.
description: For example -122.08585 (WGS 84).
term status: stable
domain includes: Geographic Coordinates
domain includes: Place
range includes: float
equivalent property: longitude

Low Earnings
type: Property
comment: Lower interquartile earnings.
term status: stable
domain includes: Aggregate Data Profile
domain includes: Earnings Profile
range includes: decimal
range includes: integer

Main Jurisdiction
type: Property
comment: Primary geographic or political region in which the credential is recognized as applicable or in which an organization has recognized authority to act.
term status: stable
sub property of: Spatial Coverage
domain includes: Jurisdiction Profile
range includes: Place

Maintenance Process
type: Property
comment: Description of a process by which a resource is maintained, including review and updating.
description: Such maintenance does not include renewal of a credential by an individual holder.
term status: stable
domain includes: Competency
domain includes: CompetencyFramework
domain includes: Rubric
domain includes: Academic Certificate
domain includes: Alignment Map
domain includes: Apprentice Certificate
domain includes: Assessment Profile
domain includes: Associate Degree
domain includes: Associate of Applied Arts Degree
domain includes: Associate of Applied Science Degree
domain includes: Associate of Arts Degree
domain includes: Associate of Science Degree
domain includes: Bachelor's Degree
domain includes: Bachelor of Arts Degree
domain includes: Bachelor of Science Degree
domain includes: Badge
domain includes: Basic Technical Certificate
domain includes: Certificate
domain includes: Certificate of Completion
domain includes: Certificate of Participation
domain includes: Certification
domain includes: Collection
domain includes: Condition Manifest
domain includes: Cost Manifest
domain includes: Course
domain includes: Credential
domain includes: Credential Organization
domain includes: Credential Type
domain includes: Degree
domain includes: Digital Badge
domain includes: Diploma
domain includes: Doctoral Degree
domain includes: General Education Development (GED)
domain includes: General Education Level 1 Certificate
domain includes: General Education Level 2 Certificate
domain includes: Higher Education Level 1 Certificate
domain includes: Higher Education Level 2 Certificate
domain includes: Job
domain includes: Journeyman Certificate
domain includes: Learning Opportunity Profile
domain includes: Learning Program
domain includes: License
domain includes: Master Trade Certificate
domain includes: Master's Degree
domain includes: Master of Arts Degree
domain includes: Master of Science Degree
domain includes: Micro-Credential
domain includes: Occupation
domain includes: Open Badge
domain includes: Organization
domain includes: Pathway
domain includes: Pathway Set
domain includes: Post-Baccalaureate Certificate
domain includes: Post-Master Certificate
domain includes: Pre-Apprenticeship Certificate
domain includes: Prior Learning Policy
domain includes: Professional Certificate
domain includes: Professional Doctorate
domain includes: Proficiency Certificate
domain includes: QA Credential Organization
domain includes: Qualifications Framework
domain includes: Quality Assurance Credential
domain includes: Research Doctorate
domain includes: Secondary Education Certificate
domain includes: Secondary School Diploma
domain includes: Specialist Degree
domain includes: Support Service
domain includes: Task
domain includes: Technical Level 1 Certificate
domain includes: Technical Level 2 Certificate
domain includes: Technical Level 3 Certificate
domain includes: Transfer Agreement
domain includes: Transfer Intermediary
domain includes: Transfer Value Profile
domain includes: Work-Based Learning Certificate

Major Alignment
type: Property
comment: Major overlap of relevant concepts between the two resources being compared.
term status: stable
sub property of: Is Similar To
domain includes: Academic Certificate
domain includes: Apprentice Certificate
domain includes: Associate Degree
domain includes: Associate of Applied Arts Degree
domain includes: Associate of Applied Science Degree
domain includes: Associate of Arts Degree
domain includes: Associate of Science Degree
domain includes: Bachelor's Degree
domain includes: Bachelor of Arts Degree
domain includes: Bachelor of Science Degree
domain includes: Badge
domain includes: Basic Technical Certificate
domain includes: Certificate
domain includes: Certificate of Completion
domain includes: Certificate of Participation
domain includes: Certification
domain includes: Credential
domain includes: Credential Type
domain includes: Degree
domain includes: Digital Badge
domain includes: Diploma
domain includes: Doctoral Degree
domain includes: General Education Development (GED)
domain includes: General Education Level 1 Certificate
domain includes: General Education Level 2 Certificate
domain includes: Higher Education Level 1 Certificate
domain includes: Higher Education Level 2 Certificate
domain includes: Journeyman Certificate
domain includes: License
domain includes: Master Trade Certificate
domain includes: Master's Degree
domain includes: Master of Arts Degree
domain includes: Master of Science Degree
domain includes: Micro-Credential
domain includes: Open Badge
domain includes: Post-Baccalaureate Certificate
domain includes: Post-Master Certificate
domain includes: Pre-Apprenticeship Certificate
domain includes: Professional Certificate
domain includes: Professional Doctorate
domain includes: Proficiency Certificate
domain includes: Quality Assurance Credential
domain includes: Research Doctorate
domain includes: Secondary Education Certificate
domain includes: Secondary School Diploma
domain includes: Specialist Degree
domain includes: Technical Level 1 Certificate
domain includes: Technical Level 2 Certificate
domain includes: Technical Level 3 Certificate
domain includes: Work-Based Learning Certificate
range includes: Academic Certificate
range includes: Apprentice Certificate
range includes: Associate Degree
range includes: Associate of Applied Arts Degree
range includes: Associate of Applied Science Degree
range includes: Associate of Arts Degree
range includes: Associate of Science Degree
range includes: Bachelor's Degree
range includes: Bachelor of Arts Degree
range includes: Bachelor of Science Degree
range includes: Badge
range includes: Basic Technical Certificate
range includes: Certificate
range includes: Certificate of Completion
range includes: Certificate of Participation
range includes: Certification
range includes: Credential
range includes: Credential Type
range includes: Degree
range includes: Digital Badge
range includes: Diploma
range includes: Doctoral Degree
range includes: General Education Development (GED)
range includes: General Education Level 1 Certificate
range includes: General Education Level 2 Certificate

Maximum Duration
type: Property
comment: Maximum overall span of time it will take to complete the activity, event, or resource.
description: This is intended to indicate overall time span, regardless of what portion of that time is spent actively pursuing the completion of the activity, event, or resource.
usage note: If a resource takes 50 hours over a span of 3-9 months to complete, use this to record 9 months as P9M. Do not use ceterms:maximumDuration to identify the renewal frequency of a credential; use ceterms:renewalFrequency instead.
term status: stable
domain includes: Duration Profile
range includes: Duration

Median earnings
type: Property
comment: Median earnings.
term status: stable
domain includes: Aggregate Data Profile
domain includes: Earnings Profile
range includes: decimal
range includes: integer

Membership Condition
type: Property
comment: Conditions and requirements to be included as a member.
term status: unstable
domain includes: Collection
range includes: Condition Profile

Minimum Age
type: Property
comment: Minimum allowed age at which a person is eligible for the credential.
term status: stable
domain includes: Condition Profile
range includes: integer

Minimum Duration
type: Property
comment: Minimum overall span of time it will take to complete the activity, event, or resource.
description: This is intended to indicate overall time span, regardless of what portion of that time is spent actively pursuing the completion of the activity, event, or resource.
usage note: If a resource takes 50 hours over a span of 3-9 months to complete, use this to record 3 months as P3M.
term status: stable
domain includes: Duration Profile
range includes: Duration

Minor Alignment
type: Property
comment: Minor overlap of relevant concepts between the two credentials being compared.
term status: stable
sub property of: Is Similar To
domain includes: Academic Certificate
domain includes: Apprentice Certificate
domain includes: Associate Degree
domain includes: Associate of Applied Arts Degree
domain includes: Associate of Applied Science Degree
domain includes: Associate of Arts Degree
domain includes: Associate of Science Degree
domain includes: Bachelor's Degree
domain includes: Bachelor of Arts Degree
domain includes: Bachelor of Science Degree
domain includes: Badge
domain includes: Basic Technical Certificate
domain includes: Certificate
domain includes: Certificate of Completion
domain includes: Certificate of Participation
domain includes: Certification
domain includes: Credential
domain includes: Credential Type
domain includes: Degree
domain includes: Digital Badge
domain includes: Diploma
domain includes: Doctoral Degree
domain includes: General Education Development (GED)
domain includes: General Education Level 1 Certificate
domain includes: General Education Level 2 Certificate
domain includes: Higher Education Level 1 Certificate
domain includes: Higher Education Level 2 Certificate
domain includes: Journeyman Certificate
domain includes: License
domain includes: Master Trade Certificate
domain includes: Master's Degree
domain includes: Master of Arts Degree
domain includes: Master of Science Degree
domain includes: Micro-Credential
domain includes: Open Badge
domain includes: Post-Baccalaureate Certificate
domain includes: Post-Master Certificate
domain includes: Pre-Apprenticeship Certificate
domain includes: Professional Certificate
domain includes: Professional Doctorate
domain includes: Proficiency Certificate
domain includes: Quality Assurance Credential
domain includes: Research Doctorate
domain includes: Secondary Education Certificate
domain includes: Secondary School Diploma
domain includes: Specialist Degree
domain includes: Technical Level 1 Certificate
domain includes: Technical Level 2 Certificate
domain includes: Technical Level 3 Certificate
domain includes: Work-Based Learning Certificate
range includes: Academic Certificate
range includes: Apprentice Certificate
range includes: Associate Degree
range includes: Associate of Applied Arts Degree
range includes: Associate of Applied Science Degree
range includes: Associate of Arts Degree
range includes: Associate of Science Degree
range includes: Bachelor's Degree
range includes: Bachelor of Arts Degree
range includes: Bachelor of Science Degree
range includes: Badge
range includes: Basic Technical Certificate
range includes: Certificate
range includes: Certificate of Completion
range includes: Certificate of Participation
range includes: Certification
range includes: Credential
range includes: Credential Type
range includes: Degree
range includes: Digital Badge
range includes: Diploma
range includes: Doctoral Degree
range includes: General Education Development (GED)
range includes: General Education Level 1 Certificate
range includes: General Education Level 2 Certificate

Mission and Goals Statement
type: Property
comment: Webpage or online document that defines or explains the mission and goals of the organization.
term status: stable
domain includes: Credential Organization
domain includes: Organization
domain includes: QA Credential Organization
range includes: anyURI

Mission and Goals Statement Description
type: Property
comment: Textual statement of the mission and goals of the organization.
term status: stable
domain includes: Credential Organization
domain includes: Organization
domain includes: QA Credential Organization
range includes: langString

NAICS
type: Property
comment: North American Industry Classification System (NAICS) code of an organization or business person.
term status: stable
domain includes: Academic Certificate
domain includes: Apprentice Certificate
domain includes: Associate Degree
domain includes: Associate of Applied Arts Degree
domain includes: Associate of Applied Science Degree
domain includes: Associate of Arts Degree
domain includes: Associate of Science Degree
domain includes: Bachelor's Degree
domain includes: Bachelor of Arts Degree
domain includes: Bachelor of Science Degree
domain includes: Badge
domain includes: Basic Technical Certificate
domain includes: Certificate
domain includes: Certificate of Completion
domain includes: Certificate of Participation
domain includes: Certification
domain includes: Credential
domain includes: Credential Organization
domain includes: Credential Type
domain includes: Degree
domain includes: Digital Badge
domain includes: Diploma
domain includes: Doctoral Degree
domain includes: General Education Development (GED)
domain includes: General Education Level 1 Certificate
domain includes: General Education Level 2 Certificate
domain includes: Higher Education Level 1 Certificate
domain includes: Higher Education Level 2 Certificate
domain includes: Journeyman Certificate
domain includes: License
domain includes: Master Trade Certificate
domain includes: Master's Degree
domain includes: Master of Arts Degree
domain includes: Master of Science Degree
domain includes: Micro-Credential
domain includes: Open Badge
domain includes: Organization
domain includes: Post-Baccalaureate Certificate
domain includes: Post-Master Certificate
domain includes: Pre-Apprenticeship Certificate
domain includes: Professional Certificate
domain includes: Professional Doctorate
domain includes: Proficiency Certificate
domain includes: QA Credential Organization
domain includes: Quality Assurance Credential
domain includes: Research Doctorate
domain includes: Secondary Education Certificate
domain includes: Secondary School Diploma
domain includes: Specialist Degree
domain includes: Technical Level 1 Certificate
domain includes: Technical Level 2 Certificate
domain includes: Technical Level 3 Certificate
domain includes: Work-Based Learning Certificate
range includes: string
equivalent property: naics

Name
type: Property
comment: Name or title of the resource.
term status: stable
domain includes: Academic Certificate
domain includes: Accredit Action
domain includes: Advanced Standing Action
domain includes: Aggregate Data Profile
domain includes: Alignment Map
domain includes: Apprentice Certificate
domain includes: Approve Action
domain includes: Assessment Component
domain includes: Assessment Profile
domain includes: Associate Degree
domain includes: Associate of Applied Arts Degree
domain includes: Associate of Applied Science Degree
domain includes: Associate of Arts Degree
domain includes: Associate of Science Degree
domain includes: Bachelor's Degree
domain includes: Bachelor of Arts Degree
domain includes: Bachelor of Science Degree
domain includes: Badge
domain includes: Basic Component
domain includes: Basic Technical Certificate
domain includes: Certificate
domain includes: Certificate of Completion
domain includes: Certificate of Participation
domain includes: Certification
domain includes: Cocurricular Component
domain includes: Collection
domain includes: Collection Component
domain includes: Collection Member
domain includes: Competency Component
domain includes: Component Condition
domain includes: Condition Manifest
domain includes: Condition Profile
domain includes: Constraint
domain includes: Contact Point
domain includes: Cost Manifest
domain includes: Cost Profile
domain includes: Course
domain includes: Course Component
domain includes: Credential
domain includes: Credential Component
domain includes: Credentialing Action
domain includes: Credential Organization
domain includes: Credential Type
domain includes: Degree
domain includes: Digital Badge
domain includes: Diploma
domain includes: Doctoral Degree
domain includes: Earnings Profile
domain includes: Employment Outcome Profile
domain includes: Evaluation Outcome
domain includes: Extracurricular Component
domain includes: Financial Assistance Profile
domain includes: General Education Development (GED)
domain includes: General Education Level 1 Certificate
domain includes: General Education Level 2 Certificate
domain includes: Geographic Coordinates
domain includes: Higher Education Level 1 Certificate
domain includes: Higher Education Level 2 Certificate
domain includes: Holders Profile
domain includes: Industry
domain includes: Job
domain includes: Job Component
domain includes: Journeyman Certificate
domain includes: Learning Opportunity Profile
domain includes: Learning Program
domain includes: License
domain includes: Master Trade Certificate
domain includes: Master's Degree
domain includes: Master of Arts Degree
domain includes: Master of Science Degree
domain includes: Micro-Credential
domain includes: Multi Component
domain includes: Occupation
domain includes: Offer Action
domain includes: Open Badge
domain includes: Organization

Narrow Alignment
type: Property
comment: Credential covers all of the relevant concepts in another credential as well as relevant concepts not found in the other credential.
term status: stable
sub property of: Is Similar To
domain includes: Academic Certificate
domain includes: Apprentice Certificate
domain includes: Associate Degree
domain includes: Associate of Applied Arts Degree
domain includes: Associate of Applied Science Degree
domain includes: Associate of Arts Degree
domain includes: Associate of Science Degree
domain includes: Bachelor's Degree
domain includes: Bachelor of Arts Degree
domain includes: Bachelor of Science Degree
domain includes: Badge
domain includes: Basic Technical Certificate
domain includes: Certificate
domain includes: Certificate of Completion
domain includes: Certificate of Participation
domain includes: Certification
domain includes: Credential
domain includes: Credential Type
domain includes: Degree
domain includes: Digital Badge
domain includes: Diploma
domain includes: Doctoral Degree
domain includes: General Education Development (GED)
domain includes: General Education Level 1 Certificate
domain includes: General Education Level 2 Certificate
domain includes: Higher Education Level 1 Certificate
domain includes: Higher Education Level 2 Certificate
domain includes: Journeyman Certificate
domain includes: License
domain includes: Master Trade Certificate
domain includes: Master's Degree
domain includes: Master of Arts Degree
domain includes: Master of Science Degree
domain includes: Micro-Credential
domain includes: Open Badge
domain includes: Post-Baccalaureate Certificate
domain includes: Post-Master Certificate
domain includes: Pre-Apprenticeship Certificate
domain includes: Professional Certificate
domain includes: Professional Doctorate
domain includes: Proficiency Certificate
domain includes: Quality Assurance Credential
domain includes: Research Doctorate
domain includes: Secondary Education Certificate
domain includes: Secondary School Diploma
domain includes: Specialist Degree
domain includes: Technical Level 1 Certificate
domain includes: Technical Level 2 Certificate
domain includes: Technical Level 3 Certificate
domain includes: Work-Based Learning Certificate
range includes: Academic Certificate
range includes: Apprentice Certificate
range includes: Associate Degree
range includes: Associate of Applied Arts Degree
range includes: Associate of Applied Science Degree
range includes: Associate of Arts Degree
range includes: Associate of Science Degree
range includes: Bachelor's Degree
range includes: Bachelor of Arts Degree
range includes: Bachelor of Science Degree
range includes: Badge
range includes: Basic Technical Certificate
range includes: Certificate
range includes: Certificate of Completion
range includes: Certificate of Participation
range includes: Certification
range includes: Credential
range includes: Credential Type
range includes: Degree
range includes: Digital Badge
range includes: Diploma
range includes: Doctoral Degree
range includes: General Education Development (GED)
range includes: General Education Level 1 Certificate
range includes: General Education Level 2 Certificate

NCES ID
type: Property
comment: Identifier comprised of a 12 digit code issued by the National Center for Education Statistics (NCES) for educational institutions where the first 7 digits are the NCES District ID.
term status: stable
domain includes: Credential Organization
range includes: string

Next Version
type: Property
comment: Version of the resource that immediately follows this version.
term status: stable
domain includes: Competency
domain includes: CompetencyFramework
domain includes: Rubric
domain includes: Academic Certificate
domain includes: Alignment Map
domain includes: Apprentice Certificate
domain includes: Associate Degree
domain includes: Associate of Applied Arts Degree
domain includes: Associate of Applied Science Degree
domain includes: Associate of Arts Degree
domain includes: Associate of Science Degree
domain includes: Bachelor's Degree
domain includes: Bachelor of Arts Degree
domain includes: Bachelor of Science Degree
domain includes: Badge
domain includes: Basic Technical Certificate
domain includes: Certificate
domain includes: Certificate of Completion
domain includes: Certificate of Participation
domain includes: Certification
domain includes: Collection
domain includes: Credential
domain includes: Credential Type
domain includes: Degree
domain includes: Digital Badge
domain includes: Diploma
domain includes: Doctoral Degree
domain includes: General Education Development (GED)
domain includes: General Education Level 1 Certificate
domain includes: General Education Level 2 Certificate
domain includes: Higher Education Level 1 Certificate
domain includes: Higher Education Level 2 Certificate
domain includes: Journeyman Certificate
domain includes: License
domain includes: Master Trade Certificate
domain includes: Master's Degree
domain includes: Master of Arts Degree
domain includes: Master of Science Degree
domain includes: Micro-Credential
domain includes: Open Badge
domain includes: Pathway
domain includes: Post-Baccalaureate Certificate
domain includes: Post-Master Certificate
domain includes: Pre-Apprenticeship Certificate
domain includes: Prior Learning Policy
domain includes: Professional Certificate
domain includes: Professional Doctorate
domain includes: Proficiency Certificate
domain includes: Qualifications Framework
domain includes: Quality Assurance Credential
domain includes: Research Doctorate
domain includes: Secondary Education Certificate
domain includes: Secondary School Diploma
domain includes: Specialist Degree
domain includes: Technical Level 1 Certificate
domain includes: Technical Level 2 Certificate
domain includes: Technical Level 3 Certificate
domain includes: Transfer Agreement
domain includes: Transfer Value Profile
domain includes: Work-Based Learning Certificate
range includes: Academic Certificate
range includes: Alignment Map
range includes: Apprentice Certificate
range includes: Associate Degree
range includes: Associate of Applied Arts Degree
range includes: Associate of Applied Science Degree
range includes: Associate of Arts Degree
range includes: Associate of Science Degree
range includes: Bachelor's Degree
range includes: Bachelor of Arts Degree
range includes: Bachelor of Science Degree
range includes: Badge
range includes: Basic Technical Certificate
range includes: Certificate
range includes: Certificate of Completion
range includes: Certificate of Participation

Number Awarded
type: Property
comment: Number of credentials awarded.
term status: stable
domain includes: Aggregate Data Profile
domain includes: Holders Profile
range includes: integer

Object
type: Property
comment: Object upon which the action is carried out, whose state is kept intact or changed.
term status: stable
domain includes: Accredit Action
domain includes: Advanced Standing Action
domain includes: Approve Action
domain includes: Credentialing Action
domain includes: Offer Action
domain includes: Recognize Action
domain includes: Registration Action
domain includes: Regulate Action
domain includes: Renew Action
domain includes: Revoke Action
domain includes: Rights Action
domain includes: Workforce Demand Action
range includes: Competency
range includes: CompetencyFramework
range includes: Academic Certificate
range includes: Apprentice Certificate
range includes: Assessment Profile
range includes: Associate Degree
range includes: Associate of Applied Arts Degree
range includes: Associate of Applied Science Degree
range includes: Associate of Arts Degree
range includes: Associate of Science Degree
range includes: Bachelor's Degree
range includes: Bachelor of Arts Degree
range includes: Bachelor of Science Degree
range includes: Badge
range includes: Basic Technical Certificate
range includes: Certificate
range includes: Certificate of Completion
range includes: Certificate of Participation
range includes: Certification
range includes: Course
range includes: Credential
range includes: Credential Organization
range includes: CredentialPerson
range includes: Degree
range includes: Digital Badge
range includes: Diploma
range includes: Doctoral Degree
range includes: General Education Development (GED)
range includes: General Education Level 1 Certificate
range includes: General Education Level 2 Certificate
range includes: Higher Education Level 1 Certificate
range includes: Higher Education Level 2 Certificate
range includes: Journeyman Certificate
range includes: Learning Opportunity Profile
range includes: Learning Program
range includes: License
range includes: Master Trade Certificate
range includes: Master's Degree
range includes: Master of Arts Degree
range includes: Master of Science Degree
range includes: Micro-Credential
range includes: Open Badge
range includes: Organization
range includes: Post-Baccalaureate Certificate
range includes: Post-Master Certificate
range includes: Pre-Apprenticeship Certificate
range includes: Professional Certificate
range includes: Professional Doctorate
range includes: Proficiency Certificate
range includes: QA Credential Organization
range includes: Quality Assurance Credential
range includes: Research Doctorate
range includes: Secondary Education Certificate
range includes: Secondary School Diploma
range includes: Specialist Degree
range includes: Technical Level 1 Certificate
range includes: Technical Level 2 Certificate
range includes: Technical Level 3 Certificate
range includes: Work-Based Learning Certificate
equivalent property: object
inverse of: Object of Action

Object of Action
type: Property
comment: Action carried out upon this resource.
term status: unstable
domain includes: Competency
domain includes: CompetencyFramework
domain includes: Academic Certificate
domain includes: Alignment Map
domain includes: Apprentice Certificate
domain includes: Assessment Profile
domain includes: Associate Degree
domain includes: Associate of Applied Arts Degree
domain includes: Associate of Applied Science Degree
domain includes: Associate of Arts Degree
domain includes: Associate of Science Degree
domain includes: Bachelor's Degree
domain includes: Bachelor of Arts Degree
domain includes: Bachelor of Science Degree
domain includes: Badge
domain includes: Basic Technical Certificate
domain includes: Certificate
domain includes: Certificate of Completion
domain includes: Certificate of Participation
domain includes: Certification
domain includes: Course
domain includes: Credential
domain includes: Credential Organization
domain includes: CredentialPerson
domain includes: Credential Type
domain includes: Degree
domain includes: Digital Badge
domain includes: Diploma
domain includes: Doctoral Degree
domain includes: General Education Development (GED)
domain includes: General Education Level 1 Certificate
domain includes: General Education Level 2 Certificate
domain includes: Higher Education Level 1 Certificate
domain includes: Higher Education Level 2 Certificate
domain includes: Journeyman Certificate
domain includes: Learning Opportunity Profile
domain includes: Learning Program
domain includes: License
domain includes: Master Trade Certificate
domain includes: Master's Degree
domain includes: Master of Arts Degree
domain includes: Master of Science Degree
domain includes: Micro-Credential
domain includes: Open Badge
domain includes: Organization
domain includes: Post-Baccalaureate Certificate
domain includes: Post-Master Certificate
domain includes: Pre-Apprenticeship Certificate
domain includes: Prior Learning Policy
domain includes: Professional Certificate
domain includes: Professional Doctorate
domain includes: Proficiency Certificate
domain includes: QA Credential Organization
domain includes: Qualifications Framework
domain includes: Quality Assurance Credential
domain includes: Research Doctorate
domain includes: Secondary Education Certificate
domain includes: Secondary School Diploma
domain includes: Specialist Degree
domain includes: Technical Level 1 Certificate
domain includes: Technical Level 2 Certificate
domain includes: Technical Level 3 Certificate
domain includes: Transfer Agreement
domain includes: Work-Based Learning Certificate
range includes: Accredit Action
range includes: Advanced Standing Action
range includes: Approve Action
range includes: Credentialing Action
range includes: Offer Action
range includes: Recognize Action
range includes: Registration Action
range includes: Regulate Action
range includes: Renew Action
range includes: Revoke Action
range includes: Rights Action
range includes: Workforce Demand Action

Occupation Type
type: Property
comment: Type of occupation; select from an existing enumeration of such types.
usage note: For U.S. resources, best practice is to identify an occupation using a framework such as the ONet. Other resources may use any framework of the class ceterms:OccupationClassification, such as the EU's ESCO, ISCO-08, and SOC 2010.
term status: stable
sub property of: credentialAlignment
domain includes: Competency
domain includes: CompetencyFramework
domain includes: Rubric
domain includes: Academic Certificate
domain includes: Apprentice Certificate
domain includes: Assessment Profile
domain includes: Associate Degree
domain includes: Associate of Applied Arts Degree
domain includes: Associate of Applied Science Degree
domain includes: Associate of Arts Degree
domain includes: Associate of Science Degree
domain includes: Bachelor's Degree
domain includes: Bachelor of Arts Degree
domain includes: Bachelor of Science Degree
domain includes: Badge
domain includes: Basic Technical Certificate
domain includes: Certificate
domain includes: Certificate of Completion
domain includes: Certificate of Participation
domain includes: Certification
domain includes: Collection
domain includes: Course
domain includes: Credential
domain includes: Degree
domain includes: Digital Badge
domain includes: Diploma
domain includes: Doctoral Degree
domain includes: General Education Development (GED)
domain includes: General Education Level 1 Certificate
domain includes: General Education Level 2 Certificate
domain includes: Higher Education Level 1 Certificate
domain includes: Higher Education Level 2 Certificate
domain includes: Job
domain includes: Job Component
domain includes: Journeyman Certificate
domain includes: Learning Opportunity Profile
domain includes: Learning Program
domain includes: License
domain includes: Master Trade Certificate
domain includes: Master's Degree
domain includes: Master of Arts Degree
domain includes: Master of Science Degree
domain includes: Micro-Credential
domain includes: Occupation
domain includes: Open Badge
domain includes: Pathway
domain includes: Post-Baccalaureate Certificate
domain includes: Post-Master Certificate
domain includes: Pre-Apprenticeship Certificate
domain includes: Professional Certificate
domain includes: Professional Doctorate
domain includes: Proficiency Certificate
domain includes: Quality Assurance Credential
domain includes: Research Doctorate
domain includes: Secondary Education Certificate
domain includes: Secondary School Diploma
domain includes: Specialist Degree
domain includes: Support Service
domain includes: Technical Level 1 Certificate
domain includes: Technical Level 2 Certificate
domain includes: Technical Level 3 Certificate
domain includes: Work-Based Learning Certificate
range includes: Credential Alignment Object
equivalent property: occupationalCategory

Offered By
type: Property
comment: Agent that offers the resource.
term status: stable
domain includes: Academic Certificate
domain includes: Apprentice Certificate
domain includes: Assessment Profile
domain includes: Associate Degree
domain includes: Associate of Applied Arts Degree
domain includes: Associate of Applied Science Degree
domain includes: Associate of Arts Degree
domain includes: Associate of Science Degree
domain includes: Bachelor's Degree
domain includes: Bachelor of Arts Degree
domain includes: Bachelor of Science Degree
domain includes: Badge
domain includes: Basic Technical Certificate
domain includes: Certificate
domain includes: Certificate of Completion
domain includes: Certificate of Participation
domain includes: Certification
domain includes: Course
domain includes: Credential
domain includes: Degree
domain includes: Digital Badge
domain includes: Diploma
domain includes: Doctoral Degree
domain includes: Financial Assistance Profile
domain includes: General Education Development (GED)
domain includes: General Education Level 1 Certificate
domain includes: General Education Level 2 Certificate
domain includes: Higher Education Level 1 Certificate
domain includes: Higher Education Level 2 Certificate
domain includes: Job
domain includes: Journeyman Certificate
domain includes: Learning Opportunity Profile
domain includes: Learning Program
domain includes: License
domain includes: Master Trade Certificate
domain includes: Master's Degree
domain includes: Master of Arts Degree
domain includes: Master of Science Degree
domain includes: Micro-Credential
domain includes: Open Badge
domain includes: Pathway
domain includes: Pathway Set
domain includes: Post-Baccalaureate Certificate
domain includes: Post-Master Certificate
domain includes: Pre-Apprenticeship Certificate
domain includes: Professional Certificate
domain includes: Professional Doctorate
domain includes: Proficiency Certificate
domain includes: Quality Assurance Credential
domain includes: Research Doctorate
domain includes: Scheduled Offering
domain includes: Secondary Education Certificate
domain includes: Secondary School Diploma
domain includes: Specialist Degree
domain includes: Support Service
domain includes: Technical Level 1 Certificate
domain includes: Technical Level 2 Certificate
domain includes: Technical Level 3 Certificate
domain includes: Verification Service Profile
domain includes: Work-Based Learning Certificate
range includes: Credential Organization
range includes: Organization
range includes: QA Credential Organization
equivalent property: provider

Offered In
type: Property
comment: Region or political jurisdiction such as a state, province or locale where the credential, learning resource or assessment is offered.
term status: stable
domain includes: Rubric
domain includes: Academic Certificate
domain includes: Apprentice Certificate
domain includes: Assessment Profile
domain includes: Associate Degree
domain includes: Associate of Applied Arts Degree
domain includes: Associate of Applied Science Degree
domain includes: Associate of Arts Degree
domain includes: Associate of Science Degree
domain includes: Bachelor's Degree
domain includes: Bachelor of Arts Degree
domain includes: Bachelor of Science Degree
domain includes: Badge
domain includes: Basic Technical Certificate
domain includes: Certificate
domain includes: Certificate of Completion
domain includes: Certificate of Participation
domain includes: Certification
domain includes: Course
domain includes: Credential
domain includes: Credential Type
domain includes: Degree
domain includes: Digital Badge
domain includes: Diploma
domain includes: Doctoral Degree
domain includes: General Education Development (GED)
domain includes: General Education Level 1 Certificate
domain includes: General Education Level 2 Certificate
domain includes: Higher Education Level 1 Certificate
domain includes: Higher Education Level 2 Certificate
domain includes: Journeyman Certificate
domain includes: Learning Opportunity Profile
domain includes: Learning Program
domain includes: License
domain includes: Master Trade Certificate
domain includes: Master's Degree
domain includes: Master of Arts Degree
domain includes: Master of Science Degree
domain includes: Micro-Credential
domain includes: Open Badge
domain includes: Post-Baccalaureate Certificate
domain includes: Post-Master Certificate
domain includes: Pre-Apprenticeship Certificate
domain includes: Professional Certificate
domain includes: Professional Doctorate
domain includes: Proficiency Certificate
domain includes: Quality Assurance Credential
domain includes: Research Doctorate
domain includes: Secondary Education Certificate
domain includes: Secondary School Diploma
domain includes: Specialist Degree
domain includes: Support Service
domain includes: Technical Level 1 Certificate
domain includes: Technical Level 2 Certificate
domain includes: Technical Level 3 Certificate
domain includes: Verification Service Profile
domain includes: Work-Based Learning Certificate
range includes: Jurisdiction Profile

Offer Frequency Type
type: Property
comment: Type of frequency at which a resource is offered; select from an existing enumeration of such types.
description: This relates to how often something starts.
usage note: For information relating to the frequency of events associated with a resource when it is running, use ceterms:scheduleFrequencyType.
term status: unstable
domain includes: Assessment Profile
domain includes: Course
domain includes: Learning Opportunity Profile
domain includes: Learning Program
domain includes: Scheduled Offering
range includes: Credential Alignment Object

Offers
type: Property
comment: Resource offered or conferred by the organization or person.
term status: stable
domain includes: Credential Organization
domain includes: Organization
domain includes: QA Credential Organization
range includes: Academic Certificate
range includes: Apprentice Certificate
range includes: Assessment Profile
range includes: Associate Degree
range includes: Associate of Applied Arts Degree
range includes: Associate of Applied Science Degree
range includes: Associate of Arts Degree
range includes: Associate of Science Degree
range includes: Bachelor's Degree
range includes: Bachelor of Arts Degree
range includes: Bachelor of Science Degree
range includes: Badge
range includes: Basic Technical Certificate
range includes: Certificate
range includes: Certificate of Completion
range includes: Certificate of Participation
range includes: Certification
range includes: Course
range includes: Credential
range includes: Degree
range includes: Digital Badge
range includes: Diploma
range includes: Doctoral Degree
range includes: General Education Development (GED)
range includes: General Education Level 1 Certificate
range includes: General Education Level 2 Certificate
range includes: Higher Education Level 1 Certificate
range includes: Higher Education Level 2 Certificate
range includes: Job
range includes: Journeyman Certificate
range includes: Learning Opportunity Profile
range includes: Learning Program
range includes: License
range includes: Master Trade Certificate
range includes: Master's Degree
range includes: Master of Arts Degree
range includes: Master of Science Degree
range includes: Micro-Credential
range includes: Open Badge
range includes: Pathway
range includes: Post-Baccalaureate Certificate
range includes: Post-Master Certificate
range includes: Pre-Apprenticeship Certificate
range includes: Professional Certificate
range includes: Professional Doctorate
range includes: Proficiency Certificate
range includes: Quality Assurance Credential
range includes: Research Doctorate
range includes: Secondary Education Certificate
range includes: Secondary School Diploma
range includes: Specialist Degree
range includes: Support Service
range includes: Technical Level 1 Certificate
range includes: Technical Level 2 Certificate
range includes: Technical Level 3 Certificate
range includes: Work-Based Learning Certificate

Offers Financial Assistance
type: Property
comment: Description of financial assistance offered by this organization.
term status: unstable
sub property of: Offers
domain includes: Credential Organization
domain includes: Organization
domain includes: QA Credential Organization
range includes: Financial Assistance Profile

OPE ID
type: Property
comment: OPE ID number (U.S. Office of Postsecondary Education Identification), sometimes referred to as the Federal School Code.
description: Identification number used by the U.S. Department of Education's Office of Postsecondary Education (OPE) to identify schools that have Program Participation Agreements (PPA) so that its students are eligible to participate in Federal Student Financial Assistance (FAFSA) programs under Title IV regulations. This is a 6-digit number followed by a 2-digit suffix used to identify branches, additional locations, and other entities that are part of the eligible institution.
term status: stable
domain includes: Credential Organization
domain includes: Organization
domain includes: QA Credential Organization
range includes: string

Owned By
type: Property
comment: Agent with an enforceable claim or legal title to the resource.
description: Agent includes credentialing organizations, quality assurance organizations and persons. It does not not include credential holders.
term status: stable
domain includes: Academic Certificate
domain includes: Alignment Map
domain includes: Apprentice Certificate
domain includes: Assessment Profile
domain includes: Associate Degree
domain includes: Associate of Applied Arts Degree
domain includes: Associate of Applied Science Degree
domain includes: Associate of Arts Degree
domain includes: Associate of Science Degree
domain includes: Bachelor's Degree
domain includes: Bachelor of Arts Degree
domain includes: Bachelor of Science Degree
domain includes: Badge
domain includes: Basic Technical Certificate
domain includes: Certificate
domain includes: Certificate of Completion
domain includes: Certificate of Participation
domain includes: Certification
domain includes: Collection
domain includes: Course
domain includes: Credential
domain includes: Credential Type
domain includes: Degree
domain includes: Digital Badge
domain includes: Diploma
domain includes: Doctoral Degree
domain includes: General Education Development (GED)
domain includes: General Education Level 1 Certificate
domain includes: General Education Level 2 Certificate
domain includes: Higher Education Level 1 Certificate
domain includes: Higher Education Level 2 Certificate
domain includes: Journeyman Certificate
domain includes: Learning Opportunity Profile
domain includes: Learning Program
domain includes: License
domain includes: Master Trade Certificate
domain includes: Master's Degree
domain includes: Master of Arts Degree
domain includes: Master of Science Degree
domain includes: Micro-Credential
domain includes: Open Badge
domain includes: Pathway
domain includes: Pathway Set
domain includes: Post-Baccalaureate Certificate
domain includes: Post-Master Certificate
domain includes: Pre-Apprenticeship Certificate
domain includes: Prior Learning Policy
domain includes: Professional Certificate
domain includes: Professional Doctorate
domain includes: Proficiency Certificate
domain includes: Qualifications Framework
domain includes: Quality Assurance Credential
domain includes: Research Doctorate
domain includes: Secondary Education Certificate
domain includes: Secondary School Diploma
domain includes: Specialist Degree
domain includes: Support Service
domain includes: Technical Level 1 Certificate
domain includes: Technical Level 2 Certificate
domain includes: Technical Level 3 Certificate
domain includes: Transfer Agreement
domain includes: Transfer Intermediary
domain includes: Transfer Value Profile
domain includes: Work-Based Learning Certificate
range includes: Credential Organization
range includes: Organization
range includes: QA Credential Organization

Owns
type: Property
comment: Resource over which the organization or person claims legal title.
term status: stable
domain includes: Credential Organization
domain includes: Organization
domain includes: QA Credential Organization
range includes: Academic Certificate
range includes: Alignment Map
range includes: Apprentice Certificate
range includes: Assessment Profile
range includes: Associate Degree
range includes: Associate of Applied Arts Degree
range includes: Associate of Applied Science Degree
range includes: Associate of Arts Degree
range includes: Associate of Science Degree
range includes: Bachelor's Degree
range includes: Bachelor of Arts Degree
range includes: Bachelor of Science Degree
range includes: Badge
range includes: Basic Technical Certificate
range includes: Certificate
range includes: Certificate of Completion
range includes: Certificate of Participation
range includes: Certification
range includes: Course
range includes: Credential
range includes: Degree
range includes: Digital Badge
range includes: Diploma
range includes: Doctoral Degree
range includes: General Education Development (GED)
range includes: General Education Level 1 Certificate
range includes: General Education Level 2 Certificate
range includes: Higher Education Level 1 Certificate
range includes: Higher Education Level 2 Certificate
range includes: Journeyman Certificate
range includes: Learning Opportunity Profile
range includes: Learning Program
range includes: License
range includes: Master Trade Certificate
range includes: Master's Degree
range includes: Master of Arts Degree
range includes: Master of Science Degree
range includes: Micro-Credential
range includes: Open Badge
range includes: Pathway
range includes: Post-Baccalaureate Certificate
range includes: Post-Master Certificate
range includes: Pre-Apprenticeship Certificate
range includes: Prior Learning Policy
range includes: Professional Certificate
range includes: Professional Doctorate
range includes: Proficiency Certificate
range includes: Qualifications Framework
range includes: Quality Assurance Credential
range includes: Research Doctorate
range includes: Secondary Education Certificate
range includes: Secondary School Diploma
range includes: Specialist Degree
range includes: Support Service
range includes: Technical Level 1 Certificate
range includes: Technical Level 2 Certificate
range includes: Technical Level 3 Certificate
range includes: TransferValueAgreement
range includes: Transfer Value Profile
range includes: Work-Based Learning Certificate

Parent Organization
type: Property
comment: Larger organization exercising authority over the organization being described.
term status: stable
domain includes: Credential Organization
domain includes: Organization
domain includes: QA Credential Organization
range includes: Credential Organization
range includes: Organization
range includes: QA Credential Organization
equivalent property: parentOrganization

Participant
type: Property
comment: Co-agents that participated in the action indirectly.
term status: stable
domain includes: Accredit Action
domain includes: Advanced Standing Action
domain includes: Approve Action
domain includes: Credentialing Action
domain includes: Offer Action
domain includes: Recognize Action
domain includes: Registration Action
domain includes: Regulate Action
domain includes: Renew Action
domain includes: Revoke Action
domain includes: Rights Action
domain includes: Workforce Demand Action
range includes: Credential Organization
range includes: Organization
range includes: QA Credential Organization
equivalent property: participant

Payment Pattern
type: Property
comment: Applicable pattern for payments such as "per semester" and "every three months".
term status: stable
domain includes: Cost Profile
range includes: langString

Performance Level Type
type: Property
comment: Type of required or expected human performance level; select from an existing enumeration of such types.
term status: unstable
domain includes: Competency
domain includes: Job
domain includes: Occupation
domain includes: Task
domain includes: Work Role
range includes: Concept

Physical Capability Type
type: Property
comment: Type of physical activity required or expected in performance; select from an existing enumeration of such types.
description: Such types may include fine motor activity, repetitive actions, climbing, kneeling, crawling, lifting heavy objects, and so on.
term status: unstable
domain includes: Competency
domain includes: Job
domain includes: Occupation
domain includes: Task
domain includes: Work Role
range includes: Concept

Point Value
type: Property
comment: Points associated with this resource, or points possible.
term status: stable
domain includes: Assessment Component
domain includes: Basic Component
domain includes: Cocurricular Component
domain includes: Collection Component
domain includes: Competency Component
domain includes: Course Component
domain includes: Credential Component
domain includes: Extracurricular Component
domain includes: Job Component
domain includes: Multi Component
domain includes: Work Experience Component
range includes: Quantitative Value

Postal Code
type: Property
comment: The postal code. For example, 94043.
term status: stable
domain includes: Place
domain includes: Postal Address
range includes: string
equivalent property: postalCode

Post Office Box Number
type: Property
comment: Post office box number for post office addresses.
term status: stable
domain includes: Place
domain includes: Postal Address
range includes: string
equivalent property: postOfficeBoxNumber

Post Receipt Months
type: Property
comment: Number of months after earning a credential when employment and earnings data is collected.
description: Number of months usually range between 3 months (one quarter) to ten years.
term status: stable
domain includes: Aggregate Data Profile
domain includes: Earnings Profile
range includes: integer

Preceded By
type: Property
comment: Resource that logically comes before this resource.
term status: unstable
domain includes: ProgressionLevel
domain includes: Assessment Component
domain includes: Basic Component
domain includes: Cocurricular Component
domain includes: Collection Component
domain includes: Competency Component
domain includes: Course Component
domain includes: Credential Component
domain includes: Extracurricular Component
domain includes: Job Component
domain includes: Multi Component
domain includes: Work Experience Component
domain includes: Concept
range includes: ProgressionLevel
range includes: Assessment Component
range includes: Basic Component
range includes: Cocurricular Component
range includes: Collection Component
range includes: Competency Component
range includes: Course Component
range includes: Credential Component
range includes: Extracurricular Component
range includes: Job Component
range includes: Multi Component
range includes: Work Experience Component
range includes: Concept
inverse of: Precedes

Precedes
type: Property
comment: Resource that logically comes after this resource.
description: The ceterms:precedes property indicates a simple or suggested ordering of resources.
term status: stable
domain includes: ProgressionLevel
domain includes: Assessment Component
domain includes: Basic Component
domain includes: Cocurricular Component
domain includes: Collection Component
domain includes: Competency Component
domain includes: Course Component
domain includes: Credential Component
domain includes: Extracurricular Component
domain includes: Job Component
domain includes: Multi Component
domain includes: Work Experience Component
domain includes: Concept
range includes: ProgressionLevel
range includes: Assessment Component
range includes: Basic Component
range includes: Cocurricular Component
range includes: Collection Component
range includes: Competency Component
range includes: Course Component
range includes: Credential Component
range includes: Extracurricular Component
range includes: Job Component
range includes: Multi Component
range includes: Work Experience Component
range includes: Concept
inverse of: Preceded By

Preparation From
type: Property
comment: Indicates a resource that is useful in preparing for the resource being described.
term status: stable
domain includes: Academic Certificate
domain includes: Apprentice Certificate
domain includes: Assessment Profile
domain includes: Associate Degree
domain includes: Associate of Applied Arts Degree
domain includes: Associate of Applied Science Degree
domain includes: Associate of Arts Degree
domain includes: Associate of Science Degree
domain includes: Bachelor's Degree
domain includes: Bachelor of Arts Degree
domain includes: Bachelor of Science Degree
domain includes: Badge
domain includes: Basic Technical Certificate
domain includes: Certificate
domain includes: Certificate of Completion
domain includes: Certificate of Participation
domain includes: Certification
domain includes: Course
domain includes: Credential
domain includes: Degree
domain includes: Digital Badge
domain includes: Diploma
domain includes: Doctoral Degree
domain includes: General Education Development (GED)
domain includes: General Education Level 1 Certificate
domain includes: General Education Level 2 Certificate
domain includes: Higher Education Level 1 Certificate
domain includes: Higher Education Level 2 Certificate
domain includes: Journeyman Certificate
domain includes: Learning Opportunity Profile
domain includes: Learning Program
domain includes: License
domain includes: Master Trade Certificate
domain includes: Master's Degree
domain includes: Master of Arts Degree
domain includes: Master of Science Degree
domain includes: Micro-Credential
domain includes: Occupation
domain includes: Open Badge
domain includes: Post-Baccalaureate Certificate
domain includes: Post-Master Certificate
domain includes: Pre-Apprenticeship Certificate
domain includes: Professional Certificate
domain includes: Professional Doctorate
domain includes: Proficiency Certificate
domain includes: Quality Assurance Credential
domain includes: Research Doctorate
domain includes: Secondary Education Certificate
domain includes: Secondary School Diploma
domain includes: Specialist Degree
domain includes: Technical Level 1 Certificate
domain includes: Technical Level 2 Certificate
domain includes: Technical Level 3 Certificate
domain includes: Work-Based Learning Certificate
range includes: Academic Certificate
range includes: Apprentice Certificate
range includes: Assessment Profile
range includes: Associate Degree
range includes: Associate of Applied Arts Degree
range includes: Associate of Applied Science Degree
range includes: Associate of Arts Degree
range includes: Associate of Science Degree
range includes: Bachelor's Degree
range includes: Bachelor of Arts Degree
range includes: Bachelor of Science Degree
range includes: Badge
range includes: Basic Technical Certificate
range includes: Certificate
range includes: Certificate of Completion
range includes: Certificate of Participation
range includes: Certification
range includes: Condition Profile
range includes: Course
range includes: Credential
range includes: Degree
range includes: Digital Badge

Prerequisite
type: Property
comment: Course that is required as a prior condition to this course.
usage note: Conditions of entry into Programs can be specified with entryCondition; requirements for Courses other than prerequisite Courses (e.g., Competencies) can be specified with requires.
term status: stable
sub property of: Requires
domain includes: Course
range includes: Course

Previous Version
type: Property
comment: Version of the resource that immediately precedes this version.
term status: stable
domain includes: Competency
domain includes: CompetencyFramework
domain includes: Rubric
domain includes: Academic Certificate
domain includes: Alignment Map
domain includes: Apprentice Certificate
domain includes: Associate Degree
domain includes: Associate of Applied Arts Degree
domain includes: Associate of Applied Science Degree
domain includes: Associate of Arts Degree
domain includes: Associate of Science Degree
domain includes: Bachelor's Degree
domain includes: Bachelor of Arts Degree
domain includes: Bachelor of Science Degree
domain includes: Badge
domain includes: Basic Technical Certificate
domain includes: Certificate
domain includes: Certificate of Completion
domain includes: Certificate of Participation
domain includes: Certification
domain includes: Collection
domain includes: Credential
domain includes: Credential Type
domain includes: Degree
domain includes: Digital Badge
domain includes: Diploma
domain includes: Doctoral Degree
domain includes: General Education Development (GED)
domain includes: General Education Level 1 Certificate
domain includes: General Education Level 2 Certificate
domain includes: Higher Education Level 1 Certificate
domain includes: Higher Education Level 2 Certificate
domain includes: Journeyman Certificate
domain includes: License
domain includes: Master Trade Certificate
domain includes: Master's Degree
domain includes: Master of Arts Degree
domain includes: Master of Science Degree
domain includes: Micro-Credential
domain includes: Open Badge
domain includes: Pathway
domain includes: Post-Baccalaureate Certificate
domain includes: Post-Master Certificate
domain includes: Pre-Apprenticeship Certificate
domain includes: Prior Learning Policy
domain includes: Professional Certificate
domain includes: Professional Doctorate
domain includes: Proficiency Certificate
domain includes: Qualifications Framework
domain includes: Quality Assurance Credential
domain includes: Research Doctorate
domain includes: Secondary Education Certificate
domain includes: Secondary School Diploma
domain includes: Specialist Degree
domain includes: Technical Level 1 Certificate
domain includes: Technical Level 2 Certificate
domain includes: Technical Level 3 Certificate
domain includes: Transfer Agreement
domain includes: Transfer Value Profile
domain includes: Work-Based Learning Certificate
range includes: Academic Certificate
range includes: Alignment Map
range includes: Apprentice Certificate
range includes: Associate Degree
range includes: Associate of Applied Arts Degree
range includes: Associate of Applied Science Degree
range includes: Associate of Arts Degree
range includes: Associate of Science Degree
range includes: Bachelor's Degree
range includes: Bachelor of Arts Degree
range includes: Bachelor of Science Degree
range includes: Badge
range includes: Basic Technical Certificate
range includes: Certificate
range includes: Certificate of Completion
range includes: Certificate of Participation

Price
type: Property
comment: Offer price of a credential, learning resource, assessment, related activity or resource.
term status: stable
domain includes: Cost Profile
range includes: decimal
equivalent property: price

Process Frequency
type: Property
comment: Interval of process occurence.
term status: stable
domain includes: Process Profile
range includes: langString

Processing Agent
type: Property
comment: Organization or person performing the process.
term status: stable
domain includes: Process Profile
range includes: Credential Organization
range includes: Organization
range includes: QA Credential Organization

Process Method
type: Property
comment: Webpage or online document that describes the process methods.
term status: stable
domain includes: Process Profile
range includes: anyURI

Process Method Description
type: Property
comment: Textual description of the process methods.
term status: stable
domain includes: Process Profile
range includes: langString

Process Standards
type: Property
comment: Webpage or online document that describes the criteria, standards, and/or requirements used with a process.
term status: stable
domain includes: Academic Certificate
domain includes: Alignment Map
domain includes: Apprentice Certificate
domain includes: Assessment Profile
domain includes: Associate Degree
domain includes: Associate of Applied Arts Degree
domain includes: Associate of Applied Science Degree
domain includes: Associate of Arts Degree
domain includes: Associate of Science Degree
domain includes: Bachelor's Degree
domain includes: Bachelor of Arts Degree
domain includes: Bachelor of Science Degree
domain includes: Badge
domain includes: Basic Technical Certificate
domain includes: Certificate
domain includes: Certificate of Completion
domain includes: Certificate of Participation
domain includes: Certification
domain includes: Credential
domain includes: Credential Type
domain includes: Degree
domain includes: Digital Badge
domain includes: Diploma
domain includes: Doctoral Degree
domain includes: General Education Development (GED)
domain includes: General Education Level 1 Certificate
domain includes: General Education Level 2 Certificate
domain includes: Higher Education Level 1 Certificate
domain includes: Higher Education Level 2 Certificate
domain includes: Journeyman Certificate
domain includes: License
domain includes: Master Trade Certificate
domain includes: Master's Degree
domain includes: Master of Arts Degree
domain includes: Master of Science Degree
domain includes: Micro-Credential
domain includes: Open Badge
domain includes: Post-Baccalaureate Certificate
domain includes: Post-Master Certificate
domain includes: Pre-Apprenticeship Certificate
domain includes: Prior Learning Policy
domain includes: Process Profile
domain includes: Professional Certificate
domain includes: Professional Doctorate
domain includes: Proficiency Certificate
domain includes: Qualifications Framework
domain includes: Quality Assurance Credential
domain includes: Research Doctorate
domain includes: Secondary Education Certificate
domain includes: Secondary School Diploma
domain includes: Specialist Degree
domain includes: Technical Level 1 Certificate
domain includes: Technical Level 2 Certificate
domain includes: Technical Level 3 Certificate
domain includes: Transfer Agreement
domain includes: Work-Based Learning Certificate
range includes: anyURI

Process Standards Description
type: Property
comment: Textual description of the criteria, standards, and/or requirements used with a process.
term status: stable
domain includes: Academic Certificate
domain includes: Alignment Map
domain includes: Apprentice Certificate
domain includes: Assessment Profile
domain includes: Associate Degree
domain includes: Associate of Applied Arts Degree
domain includes: Associate of Applied Science Degree
domain includes: Associate of Arts Degree
domain includes: Associate of Science Degree
domain includes: Bachelor's Degree
domain includes: Bachelor of Arts Degree
domain includes: Bachelor of Science Degree
domain includes: Badge
domain includes: Basic Technical Certificate
domain includes: Certificate
domain includes: Certificate of Completion
domain includes: Certificate of Participation
domain includes: Certification
domain includes: Credential
domain includes: Credential Type
domain includes: Degree
domain includes: Digital Badge
domain includes: Diploma
domain includes: Doctoral Degree
domain includes: General Education Development (GED)
domain includes: General Education Level 1 Certificate
domain includes: General Education Level 2 Certificate
domain includes: Higher Education Level 1 Certificate
domain includes: Higher Education Level 2 Certificate
domain includes: Journeyman Certificate
domain includes: License
domain includes: Master Trade Certificate
domain includes: Master's Degree
domain includes: Master of Arts Degree
domain includes: Master of Science Degree
domain includes: Micro-Credential
domain includes: Open Badge
domain includes: Post-Baccalaureate Certificate
domain includes: Post-Master Certificate
domain includes: Pre-Apprenticeship Certificate
domain includes: Prior Learning Policy
domain includes: Process Profile
domain includes: Professional Certificate
domain includes: Professional Doctorate
domain includes: Proficiency Certificate
domain includes: Qualifications Framework
domain includes: Quality Assurance Credential
domain includes: Research Doctorate
domain includes: Secondary Education Certificate
domain includes: Secondary School Diploma
domain includes: Specialist Degree
domain includes: Technical Level 1 Certificate
domain includes: Technical Level 2 Certificate
domain includes: Technical Level 3 Certificate
domain includes: Transfer Agreement
domain includes: Work-Based Learning Certificate
range includes: langString

Program Term
type: Property
comment: Categorization of a term sequence based on the normative time between entry into a program of study and its completion such as "1st quarter", "2nd quarter"..."5th quarter".
term status: stable
domain includes: Course Component
range includes: Credential Alignment Object

Provides Transfer Value For
type: Property
comment: This resource provides transfer value for the referenced Transfer Value Profile.
description: Refer to the referenced Transfer Value Profile for more information. Other resources may be included for the full value.
term status: unstable
domain includes: Competency
domain includes: Academic Certificate
domain includes: Apprentice Certificate
domain includes: Assessment Profile
domain includes: Associate Degree
domain includes: Associate of Applied Arts Degree
domain includes: Associate of Applied Science Degree
domain includes: Associate of Arts Degree
domain includes: Associate of Science Degree
domain includes: Bachelor's Degree
domain includes: Bachelor of Arts Degree
domain includes: Bachelor of Science Degree
domain includes: Badge
domain includes: Basic Technical Certificate
domain includes: Certificate
domain includes: Certificate of Completion
domain includes: Certificate of Participation
domain includes: Certification
domain includes: Course
domain includes: Credential
domain includes: Degree
domain includes: Digital Badge
domain includes: Diploma
domain includes: Doctoral Degree
domain includes: General Education Development (GED)
domain includes: General Education Level 1 Certificate
domain includes: General Education Level 2 Certificate
domain includes: Higher Education Level 1 Certificate
domain includes: Higher Education Level 2 Certificate
domain includes: Job
domain includes: Journeyman Certificate
domain includes: Learning Opportunity Profile
domain includes: Learning Program
domain includes: License
domain includes: Master Trade Certificate
domain includes: Master's Degree
domain includes: Master of Arts Degree
domain includes: Master of Science Degree
domain includes: Micro-Credential
domain includes: Occupation
domain includes: Open Badge
domain includes: Post-Baccalaureate Certificate
domain includes: Post-Master Certificate
domain includes: Pre-Apprenticeship Certificate
domain includes: Professional Certificate
domain includes: Professional Doctorate
domain includes: Proficiency Certificate
domain includes: Quality Assurance Credential
domain includes: Research Doctorate
domain includes: Secondary Education Certificate
domain includes: Secondary School Diploma
domain includes: Specialist Degree
domain includes: Technical Level 1 Certificate
domain includes: Technical Level 2 Certificate
domain includes: Technical Level 3 Certificate
domain includes: Work-Based Learning Certificate
range includes: Transfer Value Profile

Proxy For
type: Property
comment: Indicates the resource for which a pathway component or similar proxy resource is a stand-in.
description: The subject for this property will be acting as proxy in a context such as a pathway for the resource that is its object, so that assertions can be made about relationships between things in that context that are not universally true of the resources for which they are proxies.
term status: unstable
domain includes: Assessment Component
domain includes: Basic Component
domain includes: Cocurricular Component
domain includes: Collection Component
domain includes: Collection Member
domain includes: Competency Component
domain includes: Course Component
domain includes: Credential Component
domain includes: Extracurricular Component
domain includes: Job Component
domain includes: Multi Component
domain includes: Work Experience Component
range includes: anyURI

Proxy For Items
type: Property
comment: Indicates the multiple resources for which a MultiComponent proxy resource is a stand-in.
description: The subject for this property will be acting as proxy in a context such as a pathway for the resources that are its objects, so that assertions can be made about relationships between things in that context that are not universally true of the resources for which they are proxies.
term status: unstable
domain includes: Multi Component
range includes: anyURI

Quality Assurance Target Type
type: Property
comment: Types of entities that the agent accredits, endorses, approves, or recognizes; select from an existing enumeration of such types.
term status: stable
domain includes: Organization
domain includes: QA Credential Organization
range includes: CompetencyFramework
range includes: Academic Certificate
range includes: Apprentice Certificate
range includes: Assessment Profile
range includes: Associate Degree
range includes: Associate of Applied Arts Degree
range includes: Associate of Applied Science Degree
range includes: Associate of Arts Degree
range includes: Associate of Science Degree
range includes: Bachelor's Degree
range includes: Bachelor of Arts Degree
range includes: Bachelor of Science Degree
range includes: Badge
range includes: Basic Technical Certificate
range includes: Certificate
range includes: Certificate of Completion
range includes: Certificate of Participation
range includes: Certification
range includes: Course
range includes: Credential
range includes: Credential Organization
range includes: CredentialPerson
range includes: Degree
range includes: Digital Badge
range includes: Diploma
range includes: Doctoral Degree
range includes: General Education Development (GED)
range includes: General Education Level 1 Certificate
range includes: General Education Level 2 Certificate
range includes: Higher Education Level 1 Certificate
range includes: Higher Education Level 2 Certificate
range includes: Journeyman Certificate
range includes: Learning Opportunity Profile
range includes: Learning Program
range includes: License
range includes: Master Trade Certificate
range includes: Master's Degree
range includes: Master of Arts Degree
range includes: Master of Science Degree
range includes: Micro-Credential
range includes: Open Badge
range includes: Organization
range includes: Post-Baccalaureate Certificate
range includes: Post-Master Certificate
range includes: Pre-Apprenticeship Certificate
range includes: Professional Certificate
range includes: Professional Doctorate
range includes: Proficiency Certificate
range includes: QA Credential Organization
range includes: Quality Assurance Credential
range includes: Research Doctorate
range includes: Secondary Education Certificate
range includes: Secondary School Diploma
range includes: Specialist Degree
range includes: Technical Level 1 Certificate
range includes: Technical Level 2 Certificate
range includes: Technical Level 3 Certificate
range includes: Work-Based Learning Certificate

Receives Transfer Value From
type: Property
comment: This resource receives transfer value from the referenced Transfer Value Profile.
description: Refer to the referenced Transfer Value Profile for more information. Other resources may be included for the full value.
term status: unstable
domain includes: Competency
domain includes: Academic Certificate
domain includes: Apprentice Certificate
domain includes: Assessment Profile
domain includes: Associate Degree
domain includes: Associate of Applied Arts Degree
domain includes: Associate of Applied Science Degree
domain includes: Associate of Arts Degree
domain includes: Associate of Science Degree
domain includes: Bachelor's Degree
domain includes: Bachelor of Arts Degree
domain includes: Bachelor of Science Degree
domain includes: Badge
domain includes: Basic Technical Certificate
domain includes: Certificate
domain includes: Certificate of Completion
domain includes: Certificate of Participation
domain includes: Certification
domain includes: Course
domain includes: Credential
domain includes: Degree
domain includes: Digital Badge
domain includes: Diploma
domain includes: Doctoral Degree
domain includes: General Education Development (GED)
domain includes: General Education Level 1 Certificate
domain includes: General Education Level 2 Certificate
domain includes: Higher Education Level 1 Certificate
domain includes: Higher Education Level 2 Certificate
domain includes: Job
domain includes: Journeyman Certificate
domain includes: Learning Opportunity Profile
domain includes: Learning Program
domain includes: License
domain includes: Master Trade Certificate
domain includes: Master's Degree
domain includes: Master of Arts Degree
domain includes: Master of Science Degree
domain includes: Micro-Credential
domain includes: Occupation
domain includes: Open Badge
domain includes: Post-Baccalaureate Certificate
domain includes: Post-Master Certificate
domain includes: Pre-Apprenticeship Certificate
domain includes: Professional Certificate
domain includes: Professional Doctorate
domain includes: Proficiency Certificate
domain includes: Quality Assurance Credential
domain includes: Research Doctorate
domain includes: Secondary Education Certificate
domain includes: Secondary School Diploma
domain includes: Specialist Degree
domain includes: Technical Level 1 Certificate
domain includes: Technical Level 2 Certificate
domain includes: Technical Level 3 Certificate
domain includes: Work-Based Learning Certificate
range includes: Transfer Value Profile

Receiving Department
type: Property
comment: Department (or other subdivision of an organization) to which students transfer under the provisions of an agreement.
term status: unstable
domain includes: Transfer Agreement
range includes: Credential Organization
range includes: Organization

Receiving Organization
type: Property
comment: Organization to which students transfer under the provisions of an agreement.
term status: unstable
domain includes: Transfer Agreement
range includes: Credential Organization
range includes: Organization

Receiving Program
type: Property
comment: Program to which students transfer under the provisions of an agreement.
term status: unstable
domain includes: Transfer Agreement
range includes: Learning Program

Recognized By
type: Property
comment: Agent that acknowledges the validity of the resource.
term status: stable
domain includes: Academic Certificate
domain includes: Alignment Map
domain includes: Apprentice Certificate
domain includes: Assessment Profile
domain includes: Associate Degree
domain includes: Associate of Applied Arts Degree
domain includes: Associate of Applied Science Degree
domain includes: Associate of Arts Degree
domain includes: Associate of Science Degree
domain includes: Bachelor's Degree
domain includes: Bachelor of Arts Degree
domain includes: Bachelor of Science Degree
domain includes: Badge
domain includes: Basic Technical Certificate
domain includes: Certificate
domain includes: Certificate of Completion
domain includes: Certificate of Participation
domain includes: Certification
domain includes: Course
domain includes: Credential
domain includes: Credential Organization
domain includes: Credential Type
domain includes: Degree
domain includes: Digital Badge
domain includes: Diploma
domain includes: Doctoral Degree
domain includes: General Education Development (GED)
domain includes: General Education Level 1 Certificate
domain includes: General Education Level 2 Certificate
domain includes: Higher Education Level 1 Certificate
domain includes: Higher Education Level 2 Certificate
domain includes: Journeyman Certificate
domain includes: Learning Opportunity Profile
domain includes: Learning Program
domain includes: License
domain includes: Master Trade Certificate
domain includes: Master's Degree
domain includes: Master of Arts Degree
domain includes: Master of Science Degree
domain includes: Micro-Credential
domain includes: Open Badge
domain includes: Organization
domain includes: Post-Baccalaureate Certificate
domain includes: Post-Master Certificate
domain includes: Pre-Apprenticeship Certificate
domain includes: Prior Learning Policy
domain includes: Professional Certificate
domain includes: Professional Doctorate
domain includes: Proficiency Certificate
domain includes: QA Credential Organization
domain includes: Qualifications Framework
domain includes: Quality Assurance Credential
domain includes: Research Doctorate
domain includes: Secondary Education Certificate
domain includes: Secondary School Diploma
domain includes: Specialist Degree
domain includes: Technical Level 1 Certificate
domain includes: Technical Level 2 Certificate
domain includes: Technical Level 3 Certificate
domain includes: Transfer Agreement
domain includes: Work-Based Learning Certificate
range includes: Credential Organization
range includes: Organization
range includes: QA Credential Organization

Recognized In
type: Property
comment: Region or political jurisdiction such as a state, province or locale in which the resource has been publicly recommended, acknowledged or endorsed..
term status: stable
domain includes: Academic Certificate
domain includes: Alignment Map
domain includes: Apprentice Certificate
domain includes: Assessment Profile
domain includes: Associate Degree
domain includes: Associate of Applied Arts Degree
domain includes: Associate of Applied Science Degree
domain includes: Associate of Arts Degree
domain includes: Associate of Science Degree
domain includes: Bachelor's Degree
domain includes: Bachelor of Arts Degree
domain includes: Bachelor of Science Degree
domain includes: Badge
domain includes: Basic Technical Certificate
domain includes: Certificate
domain includes: Certificate of Completion
domain includes: Certificate of Participation
domain includes: Certification
domain includes: Course
domain includes: Credential
domain includes: Credential Organization
domain includes: Credential Type
domain includes: Degree
domain includes: Digital Badge
domain includes: Diploma
domain includes: Doctoral Degree
domain includes: General Education Development (GED)
domain includes: General Education Level 1 Certificate
domain includes: General Education Level 2 Certificate
domain includes: Higher Education Level 1 Certificate
domain includes: Higher Education Level 2 Certificate
domain includes: Journeyman Certificate
domain includes: Learning Opportunity Profile
domain includes: Learning Program
domain includes: License
domain includes: Master Trade Certificate
domain includes: Master's Degree
domain includes: Master of Arts Degree
domain includes: Master of Science Degree
domain includes: Micro-Credential
domain includes: Open Badge
domain includes: Organization
domain includes: Post-Baccalaureate Certificate
domain includes: Post-Master Certificate
domain includes: Pre-Apprenticeship Certificate
domain includes: Prior Learning Policy
domain includes: Professional Certificate
domain includes: Professional Doctorate
domain includes: Proficiency Certificate
domain includes: QA Credential Organization
domain includes: Qualifications Framework
domain includes: Quality Assurance Credential
domain includes: Research Doctorate
domain includes: Secondary Education Certificate
domain includes: Secondary School Diploma
domain includes: Specialist Degree
domain includes: Technical Level 1 Certificate
domain includes: Technical Level 2 Certificate
domain includes: Technical Level 3 Certificate
domain includes: Transfer Agreement
domain includes: Work-Based Learning Certificate
range includes: Jurisdiction Profile

Recognized Offerers
type: Property
comment: Organizations that have permission to offer credentials of a specific CredentialType.
usage note: The value of this property should be a ceterms:Collection of ceterms:CredentialOrganizations (or similar).
term status: unstable
domain includes: Credential Type
range includes: Collection

Recognizes
type: Property
comment: Resource that the agent recommends, endorses, indicates preference for, or otherwise provides a positive judgment.
usage note: The agent being described may or may not use a set of formal recognition criteria.
term status: stable
domain includes: Credential Organization
domain includes: Organization
domain includes: QA Credential Organization
range includes: CompetencyFramework
range includes: Academic Certificate
range includes: Apprentice Certificate
range includes: Assessment Profile
range includes: Associate Degree
range includes: Associate of Applied Arts Degree
range includes: Associate of Applied Science Degree
range includes: Associate of Arts Degree
range includes: Associate of Science Degree
range includes: Bachelor's Degree
range includes: Bachelor of Arts Degree
range includes: Bachelor of Science Degree
range includes: Badge
range includes: Basic Technical Certificate
range includes: Certificate
range includes: Certificate of Completion
range includes: Certificate of Participation
range includes: Certification
range includes: Course
range includes: Credential
range includes: Credential Organization
range includes: CredentialPerson
range includes: Degree
range includes: Digital Badge
range includes: Diploma
range includes: Doctoral Degree
range includes: General Education Development (GED)
range includes: General Education Level 1 Certificate
range includes: General Education Level 2 Certificate
range includes: Higher Education Level 1 Certificate
range includes: Higher Education Level 2 Certificate
range includes: Journeyman Certificate
range includes: Learning Opportunity Profile
range includes: Learning Program
range includes: License
range includes: Master Trade Certificate
range includes: Master's Degree
range includes: Master of Arts Degree
range includes: Master of Science Degree
range includes: Micro-Credential
range includes: Open Badge
range includes: Organization
range includes: Post-Baccalaureate Certificate
range includes: Post-Master Certificate
range includes: Pre-Apprenticeship Certificate
range includes: Professional Certificate
range includes: Professional Doctorate
range includes: Proficiency Certificate
range includes: QA Credential Organization
range includes: Quality Assurance Credential
range includes: Research Doctorate
range includes: Secondary Education Certificate
range includes: Secondary School Diploma
range includes: Specialist Degree
range includes: Technical Level 1 Certificate
range includes: Technical Level 2 Certificate
range includes: Technical Level 3 Certificate
range includes: Transfer Value Profile
range includes: Work-Based Learning Certificate

Recommends
type: Property
comment: Indicates a resource that it is advisable to earn or complete before attempting the resource being described.
term status: stable
domain includes: Academic Certificate
domain includes: Apprentice Certificate
domain includes: Assessment Profile
domain includes: Associate Degree
domain includes: Associate of Applied Arts Degree
domain includes: Associate of Applied Science Degree
domain includes: Associate of Arts Degree
domain includes: Associate of Science Degree
domain includes: Bachelor's Degree
domain includes: Bachelor of Arts Degree
domain includes: Bachelor of Science Degree
domain includes: Badge
domain includes: Basic Technical Certificate
domain includes: Certificate
domain includes: Certificate of Completion
domain includes: Certificate of Participation
domain includes: Certification
domain includes: Condition Manifest
domain includes: Course
domain includes: Credential
domain includes: Degree
domain includes: Digital Badge
domain includes: Diploma
domain includes: Doctoral Degree
domain includes: General Education Development (GED)
domain includes: General Education Level 1 Certificate
domain includes: General Education Level 2 Certificate
domain includes: Higher Education Level 1 Certificate
domain includes: Higher Education Level 2 Certificate
domain includes: Journeyman Certificate
domain includes: Learning Opportunity Profile
domain includes: Learning Program
domain includes: License
domain includes: Master Trade Certificate
domain includes: Master's Degree
domain includes: Master of Arts Degree
domain includes: Master of Science Degree
domain includes: Micro-Credential
domain includes: Occupation
domain includes: Open Badge
domain includes: Post-Baccalaureate Certificate
domain includes: Post-Master Certificate
domain includes: Pre-Apprenticeship Certificate
domain includes: Professional Certificate
domain includes: Professional Doctorate
domain includes: Proficiency Certificate
domain includes: Quality Assurance Credential
domain includes: Research Doctorate
domain includes: Secondary Education Certificate
domain includes: Secondary School Diploma
domain includes: Specialist Degree
domain includes: Technical Level 1 Certificate
domain includes: Technical Level 2 Certificate
domain includes: Technical Level 3 Certificate
domain includes: Work-Based Learning Certificate
range includes: Competency
range includes: Academic Certificate
range includes: Apprentice Certificate
range includes: Assessment Profile
range includes: Associate Degree
range includes: Associate of Applied Arts Degree
range includes: Associate of Applied Science Degree
range includes: Associate of Arts Degree
range includes: Associate of Science Degree
range includes: Bachelor's Degree
range includes: Bachelor of Arts Degree
range includes: Bachelor of Science Degree
range includes: Badge
range includes: Basic Technical Certificate
range includes: Certificate
range includes: Certificate of Completion
range includes: Certificate of Participation
range includes: Certification
range includes: Condition Profile
range includes: Course
range includes: Credential

Region
type: Property
comment: Entity that describes the longitude, latitude and other location details of an area.
term status: stable
sub property of: Spatial Coverage
domain includes: Academic Certificate
domain includes: Apprentice Certificate
domain includes: Assessment Profile
domain includes: Associate Degree
domain includes: Associate of Applied Arts Degree
domain includes: Associate of Applied Science Degree
domain includes: Associate of Arts Degree
domain includes: Associate of Science Degree
domain includes: Bachelor's Degree
domain includes: Bachelor of Arts Degree
domain includes: Bachelor of Science Degree
domain includes: Badge
domain includes: Basic Technical Certificate
domain includes: Certificate
domain includes: Certificate of Completion
domain includes: Certificate of Participation
domain includes: Certification
domain includes: Cost Profile
domain includes: Course
domain includes: Credential
domain includes: Degree
domain includes: Digital Badge
domain includes: Diploma
domain includes: Doctoral Degree
domain includes: Earnings Profile
domain includes: General Education Development (GED)
domain includes: General Education Level 1 Certificate
domain includes: General Education Level 2 Certificate
domain includes: Higher Education Level 1 Certificate
domain includes: Higher Education Level 2 Certificate
domain includes: Holders Profile
domain includes: Journeyman Certificate
domain includes: Learning Opportunity Profile
domain includes: Learning Program
domain includes: License
domain includes: Master Trade Certificate
domain includes: Master's Degree
domain includes: Master of Arts Degree
domain includes: Master of Science Degree
domain includes: Micro-Credential
domain includes: Open Badge
domain includes: Post-Baccalaureate Certificate
domain includes: Post-Master Certificate
domain includes: Pre-Apprenticeship Certificate
domain includes: Process Profile
domain includes: Professional Certificate
domain includes: Professional Doctorate
domain includes: Proficiency Certificate
domain includes: Quality Assurance Credential
domain includes: Research Doctorate
domain includes: Revocation Profile
domain includes: Secondary Education Certificate
domain includes: Secondary School Diploma
domain includes: Specialist Degree
domain includes: Technical Level 1 Certificate
domain includes: Technical Level 2 Certificate
domain includes: Technical Level 3 Certificate
domain includes: Verification Service Profile
domain includes: Work-Based Learning Certificate
range includes: Place

Registered By
type: Property
comment: Agent with which the resource is registered because it has been vetted, approved and validated to meet specific criteria.
term status: unstable
domain includes: Apprentice Certificate
domain includes: Course
domain includes: Journeyman Certificate
domain includes: Learning Opportunity Profile
domain includes: Learning Program
domain includes: Master Trade Certificate
domain includes: Pre-Apprenticeship Certificate
range includes: Credential Organization
range includes: Organization
range includes: QA Credential Organization

Regulated By
type: Property
comment: Quality assurance organization that enforces the legal requirements of the credential, learning resource or assessment.
term status: stable
domain includes: Academic Certificate
domain includes: Apprentice Certificate
domain includes: Assessment Profile
domain includes: Associate Degree
domain includes: Associate of Applied Arts Degree
domain includes: Associate of Applied Science Degree
domain includes: Associate of Arts Degree
domain includes: Associate of Science Degree
domain includes: Bachelor's Degree
domain includes: Bachelor of Arts Degree
domain includes: Bachelor of Science Degree
domain includes: Badge
domain includes: Basic Technical Certificate
domain includes: Certificate
domain includes: Certificate of Completion
domain includes: Certificate of Participation
domain includes: Certification
domain includes: Course
domain includes: Credential
domain includes: Credential Organization
domain includes: Credential Type
domain includes: Degree
domain includes: Digital Badge
domain includes: Diploma
domain includes: Doctoral Degree
domain includes: General Education Development (GED)
domain includes: General Education Level 1 Certificate
domain includes: General Education Level 2 Certificate
domain includes: Higher Education Level 1 Certificate
domain includes: Higher Education Level 2 Certificate
domain includes: Journeyman Certificate
domain includes: Learning Opportunity Profile
domain includes: Learning Program
domain includes: License
domain includes: Master Trade Certificate
domain includes: Master's Degree
domain includes: Master of Arts Degree
domain includes: Master of Science Degree
domain includes: Micro-Credential
domain includes: Open Badge
domain includes: Organization
domain includes: Post-Baccalaureate Certificate
domain includes: Post-Master Certificate
domain includes: Pre-Apprenticeship Certificate
domain includes: Professional Certificate
domain includes: Professional Doctorate
domain includes: Proficiency Certificate
domain includes: QA Credential Organization
domain includes: Quality Assurance Credential
domain includes: Research Doctorate
domain includes: Secondary Education Certificate
domain includes: Secondary School Diploma
domain includes: Specialist Degree
domain includes: Technical Level 1 Certificate
domain includes: Technical Level 2 Certificate
domain includes: Technical Level 3 Certificate
domain includes: Work-Based Learning Certificate
range includes: Organization
range includes: QA Credential Organization

Regulated In
type: Property
comment: Region or political jurisdiction such as a state, province or locale in which the credential, learning opportunity or resource is regulated.
term status: stable
domain includes: Academic Certificate
domain includes: Apprentice Certificate
domain includes: Assessment Profile
domain includes: Associate Degree
domain includes: Associate of Applied Arts Degree
domain includes: Associate of Applied Science Degree
domain includes: Associate of Arts Degree
domain includes: Associate of Science Degree
domain includes: Bachelor's Degree
domain includes: Bachelor of Arts Degree
domain includes: Bachelor of Science Degree
domain includes: Badge
domain includes: Basic Technical Certificate
domain includes: Certificate
domain includes: Certificate of Completion
domain includes: Certificate of Participation
domain includes: Certification
domain includes: Course
domain includes: Credential
domain includes: Credential Organization
domain includes: Credential Type
domain includes: Degree
domain includes: Digital Badge
domain includes: Diploma
domain includes: Doctoral Degree
domain includes: General Education Development (GED)
domain includes: General Education Level 1 Certificate
domain includes: General Education Level 2 Certificate
domain includes: Higher Education Level 1 Certificate
domain includes: Higher Education Level 2 Certificate
domain includes: Journeyman Certificate
domain includes: Learning Opportunity Profile
domain includes: Learning Program
domain includes: License
domain includes: Master Trade Certificate
domain includes: Master's Degree
domain includes: Master of Arts Degree
domain includes: Master of Science Degree
domain includes: Micro-Credential
domain includes: Open Badge
domain includes: Organization
domain includes: Post-Baccalaureate Certificate
domain includes: Post-Master Certificate
domain includes: Pre-Apprenticeship Certificate
domain includes: Professional Certificate
domain includes: Professional Doctorate
domain includes: Proficiency Certificate
domain includes: QA Credential Organization
domain includes: Quality Assurance Credential
domain includes: Research Doctorate
domain includes: Secondary Education Certificate
domain includes: Secondary School Diploma
domain includes: Specialist Degree
domain includes: Technical Level 1 Certificate
domain includes: Technical Level 2 Certificate
domain includes: Technical Level 3 Certificate
domain includes: Work-Based Learning Certificate
range includes: Jurisdiction Profile

Regulates
type: Property
comment: Credential, learning opportunity, assessment or organization that this quality assurance organization monitors, including enforcement of applicable legal requirements or standards.
description: Regulation of organizations includes authorization to act or operate.
term status: stable
domain includes: Organization
domain includes: QA Credential Organization
range includes: CompetencyFramework
range includes: Academic Certificate
range includes: Apprentice Certificate
range includes: Assessment Profile
range includes: Associate Degree
range includes: Associate of Applied Arts Degree
range includes: Associate of Applied Science Degree
range includes: Associate of Arts Degree
range includes: Associate of Science Degree
range includes: Bachelor's Degree
range includes: Bachelor of Arts Degree
range includes: Bachelor of Science Degree
range includes: Badge
range includes: Basic Technical Certificate
range includes: Certificate
range includes: Certificate of Completion
range includes: Certificate of Participation
range includes: Certification
range includes: Course
range includes: Credential
range includes: Credential Organization
range includes: Degree
range includes: Digital Badge
range includes: Diploma
range includes: Doctoral Degree
range includes: General Education Development (GED)
range includes: General Education Level 1 Certificate
range includes: General Education Level 2 Certificate
range includes: Higher Education Level 1 Certificate
range includes: Higher Education Level 2 Certificate
range includes: Journeyman Certificate
range includes: Learning Opportunity Profile
range includes: Learning Program
range includes: License
range includes: Master Trade Certificate
range includes: Master's Degree
range includes: Master of Arts Degree
range includes: Master of Science Degree
range includes: Micro-Credential
range includes: Open Badge
range includes: Organization
range includes: Post-Baccalaureate Certificate
range includes: Post-Master Certificate
range includes: Pre-Apprenticeship Certificate
range includes: Professional Certificate
range includes: Professional Doctorate
range includes: Proficiency Certificate
range includes: QA Credential Organization
range includes: Quality Assurance Credential
range includes: Research Doctorate
range includes: Secondary Education Certificate
range includes: Secondary School Diploma
range includes: Specialist Degree
range includes: Technical Level 1 Certificate
range includes: Technical Level 2 Certificate
range includes: Technical Level 3 Certificate
range includes: Work-Based Learning Certificate

Related Action
type: Property
comment: Action related to the resource.
term status: stable
domain includes: Academic Certificate
domain includes: Alignment Map
domain includes: Apprentice Certificate
domain includes: Associate Degree
domain includes: Associate of Applied Arts Degree
domain includes: Associate of Applied Science Degree
domain includes: Associate of Arts Degree
domain includes: Associate of Science Degree
domain includes: Bachelor's Degree
domain includes: Bachelor of Arts Degree
domain includes: Bachelor of Science Degree
domain includes: Badge
domain includes: Basic Technical Certificate
domain includes: Certificate
domain includes: Certificate of Completion
domain includes: Certificate of Participation
domain includes: Certification
domain includes: Credential
domain includes: Credential Type
domain includes: Degree
domain includes: Digital Badge
domain includes: Diploma
domain includes: Doctoral Degree
domain includes: General Education Development (GED)
domain includes: General Education Level 1 Certificate
domain includes: General Education Level 2 Certificate
domain includes: Higher Education Level 1 Certificate
domain includes: Higher Education Level 2 Certificate
domain includes: Journeyman Certificate
domain includes: License
domain includes: Master Trade Certificate
domain includes: Master's Degree
domain includes: Master of Arts Degree
domain includes: Master of Science Degree
domain includes: Micro-Credential
domain includes: Open Badge
domain includes: Post-Baccalaureate Certificate
domain includes: Post-Master Certificate
domain includes: Pre-Apprenticeship Certificate
domain includes: Prior Learning Policy
domain includes: Professional Certificate
domain includes: Professional Doctorate
domain includes: Proficiency Certificate
domain includes: Qualifications Framework
domain includes: Quality Assurance Credential
domain includes: Research Doctorate
domain includes: Secondary Education Certificate
domain includes: Secondary School Diploma
domain includes: Specialist Degree
domain includes: Technical Level 1 Certificate
domain includes: Technical Level 2 Certificate
domain includes: Technical Level 3 Certificate
domain includes: Transfer Agreement
domain includes: Work-Based Learning Certificate
range includes: Accredit Action
range includes: Advanced Standing Action
range includes: Approve Action
range includes: Credentialing Action
range includes: Offer Action
range includes: Recognize Action
range includes: Registration Action
range includes: Regulate Action
range includes: Renew Action
range includes: Revoke Action
range includes: Rights Action

Relevant Policy
type: Property
comment: Policy that is important in some way to this resource.
domain includes: Transfer Agreement
range includes: Prior Learning Policy

Renewal
type: Property
comment: Entity describing the constraints, prerequisites, entry conditions, or requirements necessary to maintenance and renewal of an awarded credential.
description: Generally, renewal applies to certifications and licenses; however, it may occasionally apply to other types of credentials.
term status: stable
domain includes: Academic Certificate
domain includes: Apprentice Certificate
domain includes: Associate Degree
domain includes: Associate of Applied Arts Degree
domain includes: Associate of Applied Science Degree
domain includes: Associate of Arts Degree
domain includes: Associate of Science Degree
domain includes: Bachelor's Degree
domain includes: Bachelor of Arts Degree
domain includes: Bachelor of Science Degree
domain includes: Badge
domain includes: Basic Technical Certificate
domain includes: Certificate
domain includes: Certificate of Completion
domain includes: Certificate of Participation
domain includes: Certification
domain includes: Condition Manifest
domain includes: Credential
domain includes: Degree
domain includes: Digital Badge
domain includes: Diploma
domain includes: Doctoral Degree
domain includes: General Education Development (GED)
domain includes: General Education Level 1 Certificate
domain includes: General Education Level 2 Certificate
domain includes: Higher Education Level 1 Certificate
domain includes: Higher Education Level 2 Certificate
domain includes: Journeyman Certificate
domain includes: License
domain includes: Master Trade Certificate
domain includes: Master's Degree
domain includes: Master of Arts Degree
domain includes: Master of Science Degree
domain includes: Micro-Credential
domain includes: Open Badge
domain includes: Post-Baccalaureate Certificate
domain includes: Post-Master Certificate
domain includes: Pre-Apprenticeship Certificate
domain includes: Professional Certificate
domain includes: Professional Doctorate
domain includes: Proficiency Certificate
domain includes: Quality Assurance Credential
domain includes: Research Doctorate
domain includes: Secondary Education Certificate
domain includes: Secondary School Diploma
domain includes: Specialist Degree
domain includes: Technical Level 1 Certificate
domain includes: Technical Level 2 Certificate
domain includes: Technical Level 3 Certificate
domain includes: Work-Based Learning Certificate
range includes: Condition Profile

Renewal Frequency
type: Property
comment: Frequency with which the credential needs to be renewed.
term status: stable
sub property of: Maximum Duration
domain includes: Academic Certificate
domain includes: Apprentice Certificate
domain includes: Associate Degree
domain includes: Associate of Applied Arts Degree
domain includes: Associate of Applied Science Degree
domain includes: Associate of Arts Degree
domain includes: Associate of Science Degree
domain includes: Bachelor's Degree
domain includes: Bachelor of Arts Degree
domain includes: Bachelor of Science Degree
domain includes: Badge
domain includes: Basic Technical Certificate
domain includes: Certificate
domain includes: Certificate of Completion
domain includes: Certificate of Participation
domain includes: Certification
domain includes: Credential
domain includes: Degree
domain includes: Digital Badge
domain includes: Diploma
domain includes: Doctoral Degree
domain includes: General Education Development (GED)
domain includes: General Education Level 1 Certificate
domain includes: General Education Level 2 Certificate
domain includes: Higher Education Level 1 Certificate
domain includes: Higher Education Level 2 Certificate
domain includes: Journeyman Certificate
domain includes: License
domain includes: Master Trade Certificate
domain includes: Master's Degree
domain includes: Master of Arts Degree
domain includes: Master of Science Degree
domain includes: Micro-Credential
domain includes: Open Badge
domain includes: Post-Baccalaureate Certificate
domain includes: Post-Master Certificate
domain includes: Pre-Apprenticeship Certificate
domain includes: Professional Certificate
domain includes: Professional Doctorate
domain includes: Proficiency Certificate
domain includes: Quality Assurance Credential
domain includes: Research Doctorate
domain includes: Secondary Education Certificate
domain includes: Secondary School Diploma
domain includes: Specialist Degree
domain includes: Technical Level 1 Certificate
domain includes: Technical Level 2 Certificate
domain includes: Technical Level 3 Certificate
domain includes: Work-Based Learning Certificate
range includes: Duration

Renewed By
type: Property
comment: Agent that handles the renewal of the credential.
term status: stable
domain includes: Academic Certificate
domain includes: Apprentice Certificate
domain includes: Associate Degree
domain includes: Associate of Applied Arts Degree
domain includes: Associate of Applied Science Degree
domain includes: Associate of Arts Degree
domain includes: Associate of Science Degree
domain includes: Bachelor's Degree
domain includes: Bachelor of Arts Degree
domain includes: Bachelor of Science Degree
domain includes: Badge
domain includes: Basic Technical Certificate
domain includes: Certificate
domain includes: Certificate of Completion
domain includes: Certificate of Participation
domain includes: Certification
domain includes: Credential
domain includes: Degree
domain includes: Digital Badge
domain includes: Diploma
domain includes: Doctoral Degree
domain includes: General Education Development (GED)
domain includes: General Education Level 1 Certificate
domain includes: General Education Level 2 Certificate
domain includes: Higher Education Level 1 Certificate
domain includes: Higher Education Level 2 Certificate
domain includes: Journeyman Certificate
domain includes: License
domain includes: Master Trade Certificate
domain includes: Master's Degree
domain includes: Master of Arts Degree
domain includes: Master of Science Degree
domain includes: Micro-Credential
domain includes: Open Badge
domain includes: Post-Baccalaureate Certificate
domain includes: Post-Master Certificate
domain includes: Pre-Apprenticeship Certificate
domain includes: Professional Certificate
domain includes: Professional Doctorate
domain includes: Proficiency Certificate
domain includes: Quality Assurance Credential
domain includes: Research Doctorate
domain includes: Secondary Education Certificate
domain includes: Secondary School Diploma
domain includes: Specialist Degree
domain includes: Technical Level 1 Certificate
domain includes: Technical Level 2 Certificate
domain includes: Technical Level 3 Certificate
domain includes: Work-Based Learning Certificate
range includes: Credential Organization
range includes: Organization
range includes: QA Credential Organization

Renewed In
type: Property
comment: Region or political jurisdiction such as a state, province or locale in which the credential is renewable.
term status: stable
domain includes: Academic Certificate
domain includes: Apprentice Certificate
domain includes: Associate Degree
domain includes: Associate of Applied Arts Degree
domain includes: Associate of Applied Science Degree
domain includes: Associate of Arts Degree
domain includes: Associate of Science Degree
domain includes: Bachelor's Degree
domain includes: Bachelor of Arts Degree
domain includes: Bachelor of Science Degree
domain includes: Badge
domain includes: Basic Technical Certificate
domain includes: Certificate
domain includes: Certificate of Completion
domain includes: Certificate of Participation
domain includes: Certification
domain includes: Credential
domain includes: Degree
domain includes: Digital Badge
domain includes: Diploma
domain includes: Doctoral Degree
domain includes: General Education Development (GED)
domain includes: General Education Level 1 Certificate
domain includes: General Education Level 2 Certificate
domain includes: Higher Education Level 1 Certificate
domain includes: Higher Education Level 2 Certificate
domain includes: Journeyman Certificate
domain includes: License
domain includes: Master Trade Certificate
domain includes: Master's Degree
domain includes: Master of Arts Degree
domain includes: Master of Science Degree
domain includes: Micro-Credential
domain includes: Open Badge
domain includes: Post-Baccalaureate Certificate
domain includes: Post-Master Certificate
domain includes: Pre-Apprenticeship Certificate
domain includes: Professional Certificate
domain includes: Professional Doctorate
domain includes: Proficiency Certificate
domain includes: Quality Assurance Credential
domain includes: Research Doctorate
domain includes: Secondary Education Certificate
domain includes: Secondary School Diploma
domain includes: Specialist Degree
domain includes: Technical Level 1 Certificate
domain includes: Technical Level 2 Certificate
domain includes: Technical Level 3 Certificate
domain includes: Work-Based Learning Certificate
range includes: Jurisdiction Profile

Renews
type: Property
comment: Credential type that has its validity extended by the organization or person.
description: The value of ceterms:renews should be one of the specific subclasses of ceterms:Credential.
term status: stable
domain includes: Credential Organization
domain includes: Organization
domain includes: QA Credential Organization
range includes: Academic Certificate
range includes: Apprentice Certificate
range includes: Associate Degree
range includes: Associate of Applied Arts Degree
range includes: Associate of Applied Science Degree
range includes: Associate of Arts Degree
range includes: Associate of Science Degree
range includes: Bachelor's Degree
range includes: Bachelor of Arts Degree
range includes: Bachelor of Science Degree
range includes: Badge
range includes: Basic Technical Certificate
range includes: Certificate
range includes: Certificate of Completion
range includes: Certificate of Participation
range includes: Certification
range includes: Credential
range includes: Degree
range includes: Digital Badge
range includes: Diploma
range includes: Doctoral Degree
range includes: General Education Development (GED)
range includes: General Education Level 1 Certificate
range includes: General Education Level 2 Certificate
range includes: Higher Education Level 1 Certificate
range includes: Higher Education Level 2 Certificate
range includes: Journeyman Certificate
range includes: License
range includes: Master Trade Certificate
range includes: Master's Degree
range includes: Master of Arts Degree
range includes: Master of Science Degree
range includes: Micro-Credential
range includes: Open Badge
range includes: Post-Baccalaureate Certificate
range includes: Post-Master Certificate
range includes: Pre-Apprenticeship Certificate
range includes: Professional Certificate
range includes: Professional Doctorate
range includes: Proficiency Certificate
range includes: Quality Assurance Credential
range includes: Research Doctorate
range includes: Secondary Education Certificate
range includes: Secondary School Diploma
range includes: Specialist Degree
range includes: Technical Level 1 Certificate
range includes: Technical Level 2 Certificate
range includes: Technical Level 3 Certificate
range includes: Work-Based Learning Certificate

Required Constraints
type: Property
comment: Number of hasConstraint objects that must be fulfilled in order to satisfy the ComponentCondition.
term status: unstable
domain includes: Component Condition
range includes: integer

Required Number
type: Property
comment: Number of targetComponent or hasCondition objects that must be fulfilled in order to satisfy the ComponentCondition.
term status: stable
domain includes: Component Condition
range includes: integer

Requires
type: Property
comment: Requirement or set of requirements for this resource.
usage note: Consider using the more specific subproperties of requires such as prerequisite, coPrerequisite, entryCondition, and corequisite, where appropriate.
term status: stable
domain includes: Academic Certificate
domain includes: Apprentice Certificate
domain includes: Assessment Profile
domain includes: Associate Degree
domain includes: Associate of Applied Arts Degree
domain includes: Associate of Applied Science Degree
domain includes: Associate of Arts Degree
domain includes: Associate of Science Degree
domain includes: Bachelor's Degree
domain includes: Bachelor of Arts Degree
domain includes: Bachelor of Science Degree
domain includes: Badge
domain includes: Basic Technical Certificate
domain includes: Certificate
domain includes: Certificate of Completion
domain includes: Certificate of Participation
domain includes: Certification
domain includes: Condition Manifest
domain includes: Course
domain includes: Credential
domain includes: Credential Type
domain includes: Degree
domain includes: Digital Badge
domain includes: Diploma
domain includes: Doctoral Degree
domain includes: Financial Assistance Profile
domain includes: General Education Development (GED)
domain includes: General Education Level 1 Certificate
domain includes: General Education Level 2 Certificate
domain includes: Higher Education Level 1 Certificate
domain includes: Higher Education Level 2 Certificate
domain includes: Job
domain includes: Journeyman Certificate
domain includes: Learning Opportunity Profile
domain includes: Learning Program
domain includes: License
domain includes: Master Trade Certificate
domain includes: Master's Degree
domain includes: Master of Arts Degree
domain includes: Master of Science Degree
domain includes: Micro-Credential
domain includes: Occupation
domain includes: Open Badge
domain includes: Post-Baccalaureate Certificate
domain includes: Post-Master Certificate
domain includes: Pre-Apprenticeship Certificate
domain includes: Professional Certificate
domain includes: Professional Doctorate
domain includes: Proficiency Certificate
domain includes: Quality Assurance Credential
domain includes: Research Doctorate
domain includes: Secondary Education Certificate
domain includes: Secondary School Diploma
domain includes: Specialist Degree
domain includes: Technical Level 1 Certificate
domain includes: Technical Level 2 Certificate
domain includes: Technical Level 3 Certificate
domain includes: Transfer Intermediary
domain includes: Transfer Value Profile
domain includes: Work-Based Learning Certificate
range includes: Competency
range includes: Academic Certificate
range includes: Apprentice Certificate
range includes: Assessment Profile
range includes: Associate Degree
range includes: Associate of Applied Arts Degree
range includes: Associate of Applied Science Degree
range includes: Associate of Arts Degree
range includes: Associate of Science Degree
range includes: Bachelor's Degree
range includes: Bachelor of Arts Degree
range includes: Bachelor of Science Degree
range includes: Badge
range includes: Basic Technical Certificate
range includes: Certificate

Residency Type
type: Property
comment: Type of legal residency status of a person; select from an existing enumeration of such types.
description: Residency defines the duration of stay required by national, state, provincial or local laws that entitles a person to the legal protection and benefits provided to the applicable type.
usage note: Best practice for U.S. credentials and for submission to the Credential Engine Registry, is to use concepts from the ceterms:Residency vocabulary.
term status: stable
sub property of: credentialAlignment
domain includes: Cost Profile
range includes: Credential Alignment Object

Resident Of
type: Property
comment: Geographic or political region of which a person must be a legal resident or citizen in order to be eligible for the credential.
description: Residency defines the duration of stay required by national, state, provincial or local laws that entitles a person to the legal protection and benefits provided to the applicable type.
term status: stable
domain includes: Condition Profile
range includes: Jurisdiction Profile

Result
type: Property
comment: Outcome produced in the action.
term status: unstable
domain includes: Workforce Demand Action
range includes: Credential Alignment Object

Resulting Award
type: Property
comment: Awarded credential resulting from an action.
description: An awarded credential is of the type ceterms:CredentialAssertion.
term status: stable
sub property of: Result
domain includes: Accredit Action
domain includes: Renew Action
range includes: Credential Assertion

Review Process
type: Property
comment: Description of a process by which a resource is reviewed.
term status: stable
domain includes: Competency
domain includes: CompetencyFramework
domain includes: Rubric
domain includes: Academic Certificate
domain includes: Alignment Map
domain includes: Apprentice Certificate
domain includes: Assessment Profile
domain includes: Associate Degree
domain includes: Associate of Applied Arts Degree
domain includes: Associate of Applied Science Degree
domain includes: Associate of Arts Degree
domain includes: Associate of Science Degree
domain includes: Bachelor's Degree
domain includes: Bachelor of Arts Degree
domain includes: Bachelor of Science Degree
domain includes: Badge
domain includes: Basic Technical Certificate
domain includes: Certificate
domain includes: Certificate of Completion
domain includes: Certificate of Participation
domain includes: Certification
domain includes: Collection
domain includes: Condition Manifest
domain includes: Cost Manifest
domain includes: Course
domain includes: Credential
domain includes: Credential Organization
domain includes: Credential Type
domain includes: Degree
domain includes: Digital Badge
domain includes: Diploma
domain includes: Doctoral Degree
domain includes: General Education Development (GED)
domain includes: General Education Level 1 Certificate
domain includes: General Education Level 2 Certificate
domain includes: Higher Education Level 1 Certificate
domain includes: Higher Education Level 2 Certificate
domain includes: Job
domain includes: Journeyman Certificate
domain includes: Learning Opportunity Profile
domain includes: Learning Program
domain includes: License
domain includes: Master Trade Certificate
domain includes: Master's Degree
domain includes: Master of Arts Degree
domain includes: Master of Science Degree
domain includes: Micro-Credential
domain includes: Occupation
domain includes: Open Badge
domain includes: Organization
domain includes: Pathway
domain includes: Pathway Set
domain includes: Post-Baccalaureate Certificate
domain includes: Post-Master Certificate
domain includes: Pre-Apprenticeship Certificate
domain includes: Prior Learning Policy
domain includes: Professional Certificate
domain includes: Professional Doctorate
domain includes: Proficiency Certificate
domain includes: QA Credential Organization
domain includes: Qualifications Framework
domain includes: Quality Assurance Credential
domain includes: Research Doctorate
domain includes: Secondary Education Certificate
domain includes: Secondary School Diploma
domain includes: Specialist Degree
domain includes: Support Service
domain includes: Task
domain includes: Technical Level 1 Certificate
domain includes: Technical Level 2 Certificate
domain includes: Technical Level 3 Certificate
domain includes: Transfer Agreement
domain includes: Transfer Intermediary
domain includes: Transfer Value Profile
domain includes: Work-Based Learning Certificate
domain includes: Work Role

Revocation
type: Property
comment: Entity that describes the processes and criteria for ending (revoking) the validity or operation of an awarded credential.
description: Generally, revocation applies to certifications and licenses; however, it may also apply to other types of credential under extraordinary circumstances.
term status: stable
domain includes: Academic Certificate
domain includes: Apprentice Certificate
domain includes: Associate Degree
domain includes: Associate of Applied Arts Degree
domain includes: Associate of Applied Science Degree
domain includes: Associate of Arts Degree
domain includes: Associate of Science Degree
domain includes: Bachelor's Degree
domain includes: Bachelor of Arts Degree
domain includes: Bachelor of Science Degree
domain includes: Badge
domain includes: Basic Technical Certificate
domain includes: Certificate
domain includes: Certificate of Completion
domain includes: Certificate of Participation
domain includes: Certification
domain includes: Credential
domain includes: Degree
domain includes: Digital Badge
domain includes: Diploma
domain includes: Doctoral Degree
domain includes: General Education Development (GED)
domain includes: General Education Level 1 Certificate
domain includes: General Education Level 2 Certificate
domain includes: Higher Education Level 1 Certificate
domain includes: Higher Education Level 2 Certificate
domain includes: Journeyman Certificate
domain includes: License
domain includes: Master Trade Certificate
domain includes: Master's Degree
domain includes: Master of Arts Degree
domain includes: Master of Science Degree
domain includes: Micro-Credential
domain includes: Open Badge
domain includes: Post-Baccalaureate Certificate
domain includes: Post-Master Certificate
domain includes: Pre-Apprenticeship Certificate
domain includes: Professional Certificate
domain includes: Professional Doctorate
domain includes: Proficiency Certificate
domain includes: Quality Assurance Credential
domain includes: Research Doctorate
domain includes: Secondary Education Certificate
domain includes: Secondary School Diploma
domain includes: Specialist Degree
domain includes: Technical Level 1 Certificate
domain includes: Technical Level 2 Certificate
domain includes: Technical Level 3 Certificate
domain includes: Work-Based Learning Certificate
range includes: Revocation Profile

Revocation Criteria
type: Property
comment: Webpage or online document that provides information about the removal criteria for an awarded credential.
term status: stable
domain includes: Revocation Profile
range includes: anyURI

Revocation Criteria
type: Property
comment: Textual description providing information about the removal criteria for an awarded credential.
term status: stable
domain includes: Revocation Profile
range includes: langString

Revocation Process
type: Property
comment: Entity describing the process by which the credential is revoked.
term status: stable
domain includes: Academic Certificate
domain includes: Alignment Map
domain includes: Apprentice Certificate
domain includes: Associate Degree
domain includes: Associate of Applied Arts Degree
domain includes: Associate of Applied Science Degree
domain includes: Associate of Arts Degree
domain includes: Associate of Science Degree
domain includes: Bachelor's Degree
domain includes: Bachelor of Arts Degree
domain includes: Bachelor of Science Degree
domain includes: Badge
domain includes: Basic Technical Certificate
domain includes: Certificate
domain includes: Certificate of Completion
domain includes: Certificate of Participation
domain includes: Certification
domain includes: Credential
domain includes: Credential Organization
domain includes: Degree
domain includes: Digital Badge
domain includes: Diploma
domain includes: Doctoral Degree
domain includes: General Education Development (GED)
domain includes: General Education Level 1 Certificate
domain includes: General Education Level 2 Certificate
domain includes: Higher Education Level 1 Certificate
domain includes: Higher Education Level 2 Certificate
domain includes: Journeyman Certificate
domain includes: License
domain includes: Master Trade Certificate
domain includes: Master's Degree
domain includes: Master of Arts Degree
domain includes: Master of Science Degree
domain includes: Micro-Credential
domain includes: Open Badge
domain includes: Organization
domain includes: Post-Baccalaureate Certificate
domain includes: Post-Master Certificate
domain includes: Pre-Apprenticeship Certificate
domain includes: Professional Certificate
domain includes: Professional Doctorate
domain includes: Proficiency Certificate
domain includes: QA Credential Organization
domain includes: Qualifications Framework
domain includes: Quality Assurance Credential
domain includes: Research Doctorate
domain includes: Secondary Education Certificate
domain includes: Secondary School Diploma
domain includes: Specialist Degree
domain includes: Technical Level 1 Certificate
domain includes: Technical Level 2 Certificate
domain includes: Technical Level 3 Certificate
domain includes: Work-Based Learning Certificate
range includes: Process Profile

Revoked By
type: Property
comment: Agent that handles revocation of an awarded credential due to violations or failure to renew.
term status: stable
domain includes: Academic Certificate
domain includes: Apprentice Certificate
domain includes: Associate Degree
domain includes: Associate of Applied Arts Degree
domain includes: Associate of Applied Science Degree
domain includes: Associate of Arts Degree
domain includes: Associate of Science Degree
domain includes: Bachelor's Degree
domain includes: Bachelor of Arts Degree
domain includes: Bachelor of Science Degree
domain includes: Badge
domain includes: Basic Technical Certificate
domain includes: Certificate
domain includes: Certificate of Completion
domain includes: Certificate of Participation
domain includes: Certification
domain includes: Credential
domain includes: Degree
domain includes: Digital Badge
domain includes: Diploma
domain includes: Doctoral Degree
domain includes: General Education Development (GED)
domain includes: General Education Level 1 Certificate
domain includes: General Education Level 2 Certificate
domain includes: Higher Education Level 1 Certificate
domain includes: Higher Education Level 2 Certificate
domain includes: Journeyman Certificate
domain includes: License
domain includes: Master Trade Certificate
domain includes: Master's Degree
domain includes: Master of Arts Degree
domain includes: Master of Science Degree
domain includes: Micro-Credential
domain includes: Open Badge
domain includes: Post-Baccalaureate Certificate
domain includes: Post-Master Certificate
domain includes: Pre-Apprenticeship Certificate
domain includes: Professional Certificate
domain includes: Professional Doctorate
domain includes: Proficiency Certificate
domain includes: Quality Assurance Credential
domain includes: Research Doctorate
domain includes: Secondary Education Certificate
domain includes: Secondary School Diploma
domain includes: Specialist Degree
domain includes: Technical Level 1 Certificate
domain includes: Technical Level 2 Certificate
domain includes: Technical Level 3 Certificate
domain includes: Work-Based Learning Certificate
range includes: Credential Organization
range includes: Organization
range includes: QA Credential Organization

Revoked In
type: Property
comment: Region or political jurisdiction such as a state, province or locale in which the credential can be revoked.
term status: stable
domain includes: Academic Certificate
domain includes: Apprentice Certificate
domain includes: Associate Degree
domain includes: Associate of Applied Arts Degree
domain includes: Associate of Applied Science Degree
domain includes: Associate of Arts Degree
domain includes: Associate of Science Degree
domain includes: Bachelor's Degree
domain includes: Bachelor of Arts Degree
domain includes: Bachelor of Science Degree
domain includes: Badge
domain includes: Basic Technical Certificate
domain includes: Certificate
domain includes: Certificate of Completion
domain includes: Certificate of Participation
domain includes: Certification
domain includes: Credential
domain includes: Degree
domain includes: Digital Badge
domain includes: Diploma
domain includes: Doctoral Degree
domain includes: General Education Development (GED)
domain includes: General Education Level 1 Certificate
domain includes: General Education Level 2 Certificate
domain includes: Higher Education Level 1 Certificate
domain includes: Higher Education Level 2 Certificate
domain includes: Journeyman Certificate
domain includes: License
domain includes: Master Trade Certificate
domain includes: Master's Degree
domain includes: Master of Arts Degree
domain includes: Master of Science Degree
domain includes: Micro-Credential
domain includes: Open Badge
domain includes: Post-Baccalaureate Certificate
domain includes: Post-Master Certificate
domain includes: Pre-Apprenticeship Certificate
domain includes: Professional Certificate
domain includes: Professional Doctorate
domain includes: Proficiency Certificate
domain includes: Quality Assurance Credential
domain includes: Research Doctorate
domain includes: Secondary Education Certificate
domain includes: Secondary School Diploma
domain includes: Specialist Degree
domain includes: Technical Level 1 Certificate
domain includes: Technical Level 2 Certificate
domain includes: Technical Level 3 Certificate
domain includes: Work-Based Learning Certificate
range includes: Jurisdiction Profile

Revokes
type: Property
comment: Credential type that can be invalidated or retracted by the awarding agent.
description: The value of ceterms:revokes should be one of the specific subclasses of ceterms:Credential.
term status: stable
domain includes: Credential Organization
domain includes: Organization
domain includes: QA Credential Organization
range includes: Academic Certificate
range includes: Apprentice Certificate
range includes: Associate Degree
range includes: Associate of Applied Arts Degree
range includes: Associate of Applied Science Degree
range includes: Associate of Arts Degree
range includes: Associate of Science Degree
range includes: Bachelor's Degree
range includes: Bachelor of Arts Degree
range includes: Bachelor of Science Degree
range includes: Badge
range includes: Basic Technical Certificate
range includes: Certificate
range includes: Certificate of Completion
range includes: Certificate of Participation
range includes: Certification
range includes: Credential
range includes: Degree
range includes: Digital Badge
range includes: Diploma
range includes: Doctoral Degree
range includes: General Education Development (GED)
range includes: General Education Level 1 Certificate
range includes: General Education Level 2 Certificate
range includes: Higher Education Level 1 Certificate
range includes: Higher Education Level 2 Certificate
range includes: Journeyman Certificate
range includes: License
range includes: Master Trade Certificate
range includes: Master's Degree
range includes: Master of Arts Degree
range includes: Master of Science Degree
range includes: Micro-Credential
range includes: Open Badge
range includes: Post-Baccalaureate Certificate
range includes: Post-Master Certificate
range includes: Pre-Apprenticeship Certificate
range includes: Professional Certificate
range includes: Professional Doctorate
range includes: Proficiency Certificate
range includes: Quality Assurance Credential
range includes: Research Doctorate
range includes: Secondary Education Certificate
range includes: Secondary School Diploma
range includes: Specialist Degree
range includes: Technical Level 1 Certificate
range includes: Technical Level 2 Certificate
range includes: Technical Level 3 Certificate
range includes: Work-Based Learning Certificate

Right Action
type: Property
comment: Action performed on the right source; select from an existing enumeration of such types.
term status: unstable
domain includes: Constraint
range includes: Concept

Right Source
type: Property
comment: Right hand parameter of a constraint.
term status: unstable
domain includes: Constraint
range includes: Property
range includes: Class
range includes: Literal
range includes: Concept

Same As
type: Property
comment: Another source of information about the entity being described.
description: Other sources may include descriptions of entities in open databases such as DBpedia, Wikidata, the Credential Engine Registry, or other platforms.
term status: stable
domain includes: ProgressionLevel
domain includes: ProgressionModel
domain includes: Academic Certificate
domain includes: Alignment Map
domain includes: Apprentice Certificate
domain includes: Assessment Profile
domain includes: Associate Degree
domain includes: Associate of Applied Arts Degree
domain includes: Associate of Applied Science Degree
domain includes: Associate of Arts Degree
domain includes: Associate of Science Degree
domain includes: Bachelor's Degree
domain includes: Bachelor of Arts Degree
domain includes: Bachelor of Science Degree
domain includes: Badge
domain includes: Basic Technical Certificate
domain includes: Certificate
domain includes: Certificate of Completion
domain includes: Certificate of Participation
domain includes: Certification
domain includes: Course
domain includes: Credential
domain includes: Credential Organization
domain includes: Credential Type
domain includes: Degree
domain includes: Digital Badge
domain includes: Diploma
domain includes: Doctoral Degree
domain includes: General Education Development (GED)
domain includes: General Education Level 1 Certificate
domain includes: General Education Level 2 Certificate
domain includes: Higher Education Level 1 Certificate
domain includes: Higher Education Level 2 Certificate
domain includes: Industry
domain includes: Job
domain includes: Journeyman Certificate
domain includes: Learning Opportunity Profile
domain includes: Learning Program
domain includes: License
domain includes: Master Trade Certificate
domain includes: Master's Degree
domain includes: Master of Arts Degree
domain includes: Master of Science Degree
domain includes: Micro-Credential
domain includes: Occupation
domain includes: Open Badge
domain includes: Organization
domain includes: Post-Baccalaureate Certificate
domain includes: Post-Master Certificate
domain includes: Pre-Apprenticeship Certificate
domain includes: Prior Learning Policy
domain includes: Professional Certificate
domain includes: Professional Doctorate
domain includes: Proficiency Certificate
domain includes: QA Credential Organization
domain includes: Qualifications Framework
domain includes: Quality Assurance Credential
domain includes: Research Doctorate
domain includes: Secondary Education Certificate
domain includes: Secondary School Diploma
domain includes: Specialist Degree
domain includes: Technical Level 1 Certificate
domain includes: Technical Level 2 Certificate
domain includes: Technical Level 3 Certificate
domain includes: Transfer Agreement
domain includes: Work-Based Learning Certificate
range includes: anyURI

SCED
type: Property
comment: School Courses for the Exchange of Data code for a course.
usage note: It is preferable to record the whole 12 character alphanumeric code, however it is also valid to record just the five digit subject code + course number.
term status: unstable
domain includes: Course
range includes: string

Schedule Frequency Type
type: Property
comment: Type of frequency indicating the cadence at which events associated with a resource typically occur; select from an existing enumeration of such types.
description: This relates to the frequency of events associated with a resource once it is running.
usage note: For information relating to how often something starts, use ceterms:offerFrequencyType.
term status: unstable
domain includes: Assessment Profile
domain includes: Course
domain includes: Learning Opportunity Profile
domain includes: Learning Program
domain includes: Scheduled Offering
range includes: Credential Alignment Object

Schedule Timing Type
type: Property
comment: Type of time at which events typically occur; select from an existing enumeration of such types.
term status: unstable
domain includes: Assessment Profile
domain includes: Course
domain includes: Learning Opportunity Profile
domain includes: Learning Program
domain includes: Scheduled Offering
range includes: Credential Alignment Object

Scoring Method Description
type: Property
comment: Textual description of the method used to score the assessment.
term status: stable
domain includes: Assessment Profile
domain includes: Process Profile
range includes: langString

Scoring Method Example
type: Property
comment: Webpage or online document providing an example of the method or tool used to score the assessment.
term status: stable
domain includes: Assessment Profile
domain includes: Process Profile
range includes: anyURI

Scoring Method Example Description
type: Property
comment: Textual example of the method or tool used to score the assessment.
term status: stable
domain includes: Assessment Profile
domain includes: Process Profile
range includes: langString

Scoring Method Type
type: Property
comment: Type of method used to score the assessment; select from an existing enumeration of such types.
usage note: Best practice for U.S. credentials and for submission to the Credential Engine Registry, is to use concepts from the ceterms:ScoringMethod vocabulary.
term status: stable
domain includes: Assessment Profile
range includes: Credential Alignment Object

Sending Department
type: Property
comment: Department (or other subdivision of an organization) from which students transfer under the provisions of an agreement.
term status: unstable
domain includes: Transfer Agreement
range includes: Credential Organization
range includes: Organization

Sending Organization
type: Property
comment: Organization from which students transfer under the provisions of an agreement.
term status: unstable
domain includes: Transfer Agreement
range includes: Credential Organization
range includes: Organization

Sending Program
type: Property
comment: Program from which students transfer under the provisions of an agreement.
term status: unstable
domain includes: Transfer Agreement
range includes: Learning Program

Sensory Capability Type
type: Property
comment: Type of required or expected sensory capability; select from an existing enumeration of such types.
description: Such types may include smell, color discrimination, depth perception, and so on.
term status: unstable
domain includes: Competency
domain includes: Job
domain includes: Occupation
domain includes: Task
domain includes: Work Role
range includes: Concept

Service Type
type: Property
comment: Type of service offered by the agent being described; select from an existing enumeration of such terms.
usage note: Recommended best practice for credentials in the Credential Engine Registry is to use concepts from the ceterms:AgentServiceType vocabulary.
term status: stable
domain includes: Credential Organization
domain includes: Organization
domain includes: QA Credential Organization
range includes: Credential Alignment Object

Social Media
type: Property
comment: Social media access point for an agent or an agent's contact point.
term status: stable
domain includes: Contact Point
domain includes: Credential Organization
domain includes: Organization
domain includes: QA Credential Organization
range includes: anyURI

Source URL
type: Property
comment: Authoritative source of an entity's information.
description: Citation or description of an authoritative source from which information or description has been derived.
term status: stable
domain includes: Aggregate Data Profile
domain includes: Alignment Map
domain includes: Earnings Profile
domain includes: Employment Outcome Profile
domain includes: Holders Profile
domain includes: Qualifications Framework
domain includes: DataSetDistribution
domain includes: DataSetProfile
range includes: anyURI

Source Data
type: Property
comment: Structured data representing the resource.
description: The preferred data serialization is JSON-LD or some other serialization of RDF.
term status: stable
domain includes: Assessment Component
domain includes: Basic Component
domain includes: Cocurricular Component
domain includes: Collection Component
domain includes: Competency Component
domain includes: Course Component
domain includes: Credential Component
domain includes: Extracurricular Component
domain includes: Job Component
domain includes: Multi Component
domain includes: Work Experience Component
range includes: anyURI

Source Node
type: Property
comment: Individual entry in a formally defined framework that is the source of an alignment.
description: This is the node to which the target node is being compared. It is the subject of the property used as the alignment type.
usage note: "Framework" may be interpreted broadly to include any scheme or schema for organizing and referencing resources.
term status: unstable
domain includes: Alignment Object
range includes: anyURI

Source Node Description
type: Property
comment: Textual description of an individual entry in a formally defined framework that is the source of an alignment.
description: This relates to the node to which the target node is being compared, that is the subject of the property used as the alignment type.
usage note: "Framework" may be interpreted broadly to include any scheme or schema for organizing and referencing resources.
term status: unstable
domain includes: Alignment Object
range includes: langString

Source Node Name
type: Property
comment: Name of an individual entry in a formally defined framework that is the source of an alignment.
description: This relates to the node to which the target node is being compared, that is the subject of the property used as the alignment type.
usage note: "Framework" may be interpreted broadly to include any scheme or schema for organizing and referencing resources.
term status: unstable
domain includes: Alignment Object
range includes: langString

Spatial Coverage
type: Property
comment: Spatial coverage of an entity indicates the place(s) to which its content applies or in which it occurs.
description: In the CTDL, the ceterms:spatialCoverage property serves as a super-property for an array of sub-properties defining location-dependent or area-dependent aspects of a resource.
term status: stable
range includes: Geographic Coordinates
range includes: Jurisdiction Profile
range includes: Place
range includes: Postal Address
equivalent property: spatialCoverage

Start Date
type: Property
comment: Date the validity or usefulness of the information in this resource begins.
term status: stable
sub property of: Temporal Coverage
domain includes: Accredit Action
domain includes: Advanced Standing Action
domain includes: Approve Action
domain includes: Collection Member
domain includes: Cost Manifest
domain includes: Cost Profile
domain includes: Credentialing Action
domain includes: Offer Action
domain includes: Recognize Action
domain includes: Registration Action
domain includes: Regulate Action
domain includes: Renew Action
domain includes: Revoke Action
domain includes: Rights Action
domain includes: Transfer Value Profile
domain includes: Workforce Demand Action
domain includes: DataSetTimeFrame
range includes: date
equivalent property: startDate

Start Time
type: Property
comment: Start time of an event or activity.
term status: stable
sub property of: Temporal Coverage
range includes: dateTime
equivalent property: startTime

Statement Text
type: Property
comment: Verbatim unformatted text of a statement, typically one made in a larger document.
usage note: Use ceterms:description if the data provided is a summary of the content, e.g. when linking to the statement.
term status: unstable
domain includes: Structured Statement
range includes: langString

Statement Type
type: Property
comment: Indicates the topic or nature of the statement within the context of the document being represented.
usage note: Best practice is to draw from an existing concept scheme such as ceterms:StatementCategory, which may be supplemented by more precise terms from a locally defined concept scheme if required.
term status: unstable
domain includes: Structured Statement
range includes: Concept

Street Address
type: Property
comment: Street address. e.g. "1600 Amphitheatre Pkwy".
term status: stable
domain includes: Place
domain includes: Postal Address
range includes: langString
equivalent property: streetAddress

Subclass Of
type: Property
comment: Indicates a broader type or class than the one being described.
description: Similar to rdfs:subClassOf, this property means that all examples of the type of resource being described are also instances of the class indicated, however it does not imply that the subject is an rdfs:Class.
usage note: Used in CTDL to indicate the Credential Class (i.e. subclass of ceterms:Credential) that encompasses this type of credential.
term status: unstable
domain includes: Credential Type
range includes: anyURI

Subject
type: Property
comment: Words or brief phrases describing the topicality of the entity; select subject terms from an existing enumeration of such terms.
usage note: Use the subject property to reference a concept in a controlled vocabulary. Free text subjects should use the keyword property.
term status: stable
sub property of: about
domain includes: Rubric
domain includes: Academic Certificate
domain includes: Alignment Map
domain includes: Apprentice Certificate
domain includes: Assessment Profile
domain includes: Associate Degree
domain includes: Associate of Applied Arts Degree
domain includes: Associate of Applied Science Degree
domain includes: Associate of Arts Degree
domain includes: Associate of Science Degree
domain includes: Bachelor's Degree
domain includes: Bachelor of Arts Degree
domain includes: Bachelor of Science Degree
domain includes: Badge
domain includes: Basic Technical Certificate
domain includes: Certificate
domain includes: Certificate of Completion
domain includes: Certificate of Participation
domain includes: Certification
domain includes: Collection
domain includes: Course
domain includes: Credential
domain includes: Credential Type
domain includes: Degree
domain includes: Digital Badge
domain includes: Diploma
domain includes: Doctoral Degree
domain includes: General Education Development (GED)
domain includes: General Education Level 1 Certificate
domain includes: General Education Level 2 Certificate
domain includes: Higher Education Level 1 Certificate
domain includes: Higher Education Level 2 Certificate
domain includes: Journeyman Certificate
domain includes: Learning Opportunity Profile
domain includes: Learning Program
domain includes: License
domain includes: Master Trade Certificate
domain includes: Master's Degree
domain includes: Master of Arts Degree
domain includes: Master of Science Degree
domain includes: Micro-Credential
domain includes: Open Badge
domain includes: Pathway
domain includes: Post-Baccalaureate Certificate
domain includes: Post-Master Certificate
domain includes: Pre-Apprenticeship Certificate
domain includes: Professional Certificate
domain includes: Professional Doctorate
domain includes: Proficiency Certificate
domain includes: Qualifications Framework
domain includes: Quality Assurance Credential
domain includes: Research Doctorate
domain includes: Secondary Education Certificate
domain includes: Secondary School Diploma
domain includes: Specialist Degree
domain includes: Technical Level 1 Certificate
domain includes: Technical Level 2 Certificate
domain includes: Technical Level 3 Certificate
domain includes: Transfer Intermediary
domain includes: Value Profile
domain includes: Work-Based Learning Certificate
range includes: Credential Alignment Object

Subject Webpage
type: Property
comment: Webpage that describes this entity.
description: The web page being referenced describes the entity. The value of subjectWebpage is an authoritative location for information about the subject but should not be assumed to be a persistent identifier of the subject.
term status: stable
domain includes: Rubric
domain includes: Academic Certificate
domain includes: Alignment Map
domain includes: Apprentice Certificate
domain includes: Assessment Component
domain includes: Assessment Profile
domain includes: Associate Degree
domain includes: Associate of Applied Arts Degree
domain includes: Associate of Applied Science Degree
domain includes: Associate of Arts Degree
domain includes: Associate of Science Degree
domain includes: Bachelor's Degree
domain includes: Bachelor of Arts Degree
domain includes: Bachelor of Science Degree
domain includes: Badge
domain includes: Basic Component
domain includes: Basic Technical Certificate
domain includes: Certificate
domain includes: Certificate of Completion
domain includes: Certificate of Participation
domain includes: Certification
domain includes: Cocurricular Component
domain includes: Collection
domain includes: Collection Component
domain includes: Competency Component
domain includes: Condition Manifest
domain includes: Condition Profile
domain includes: Course
domain includes: Course Component
domain includes: Credential
domain includes: Credential Component
domain includes: Credential Organization
domain includes: Credential Type
domain includes: Degree
domain includes: Digital Badge
domain includes: Diploma
domain includes: Doctoral Degree
domain includes: Evaluation Outcome
domain includes: Extracurricular Component
domain includes: Financial Assistance Profile
domain includes: General Education Development (GED)
domain includes: General Education Level 1 Certificate
domain includes: General Education Level 2 Certificate
domain includes: Higher Education Level 1 Certificate
domain includes: Higher Education Level 2 Certificate
domain includes: Industry
domain includes: Job
domain includes: Job Component
domain includes: Journeyman Certificate
domain includes: Learning Opportunity Profile
domain includes: Learning Program
domain includes: License
domain includes: Master Trade Certificate
domain includes: Master's Degree
domain includes: Master of Arts Degree
domain includes: Master of Science Degree
domain includes: Micro-Credential
domain includes: Multi Component
domain includes: Occupation
domain includes: Open Badge
domain includes: Organization
domain includes: Pathway
domain includes: Pathway Set
domain includes: Place
domain includes: Post-Baccalaureate Certificate
domain includes: Post-Master Certificate
domain includes: Pre-Apprenticeship Certificate
domain includes: Prior Learning Policy
domain includes: Process Profile
domain includes: Professional Certificate
domain includes: Professional Doctorate
domain includes: Proficiency Certificate
domain includes: QA Credential Organization
domain includes: Qualifications Framework
domain includes: Quality Assurance Credential

Submission Of
type: Property
comment: Artifact to be submitted such as a transcript, portfolio, or an affidavit.
term status: stable
domain includes: Condition Profile
range includes: anyURI

Submission Of Description
type: Property
comment: Name, label, or description of an artifact to be submitted such as a transcript, portfolio, or an affidavit.
term status: stable
domain includes: Condition Profile
range includes: langString

Sub-Organization
type: Property
comment: Organization in a subordinate or lower position than a parent organization.
term status: stable
domain includes: Credential Organization
domain includes: Organization
domain includes: QA Credential Organization
range includes: Credential Organization
range includes: Organization
range includes: QA Credential Organization
equivalent property: subOrganization

Sub-region
type: Property
comment: An administrative subdivision within a country that is intermediate between a region and a locality.
description: This may be referred to as a county in the United States, a département in France, a district in India, a raion in Russia, a municipio in Mexico, or equivalent terms in other jurisdictions.
term status: unstable
domain includes: Place
range includes: langString

Superseded By
type: Property
comment: Resource that replaces this resource.
description: For example, a credential that outright replaces the credential being described, and is not simply a newer version of the same credential (the two credentials have different CTIDs).
term status: stable
domain includes: Academic Certificate
domain includes: Alignment Map
domain includes: Apprentice Certificate
domain includes: Assessment Profile
domain includes: Associate Degree
domain includes: Associate of Applied Arts Degree
domain includes: Associate of Applied Science Degree
domain includes: Associate of Arts Degree
domain includes: Associate of Science Degree
domain includes: Bachelor's Degree
domain includes: Bachelor of Arts Degree
domain includes: Bachelor of Science Degree
domain includes: Badge
domain includes: Basic Technical Certificate
domain includes: Certificate
domain includes: Certificate of Completion
domain includes: Certificate of Participation
domain includes: Certification
domain includes: Course
domain includes: Credential
domain includes: Credential Organization
domain includes: Credential Type
domain includes: Degree
domain includes: Digital Badge
domain includes: Diploma
domain includes: Doctoral Degree
domain includes: General Education Development (GED)
domain includes: General Education Level 1 Certificate
domain includes: General Education Level 2 Certificate
domain includes: Higher Education Level 1 Certificate
domain includes: Higher Education Level 2 Certificate
domain includes: Journeyman Certificate
domain includes: Learning Opportunity Profile
domain includes: Learning Program
domain includes: License
domain includes: Master Trade Certificate
domain includes: Master's Degree
domain includes: Master of Arts Degree
domain includes: Master of Science Degree
domain includes: Micro-Credential
domain includes: Open Badge
domain includes: Organization
domain includes: Post-Baccalaureate Certificate
domain includes: Post-Master Certificate
domain includes: Pre-Apprenticeship Certificate
domain includes: Prior Learning Policy
domain includes: Professional Certificate
domain includes: Professional Doctorate
domain includes: Proficiency Certificate
domain includes: QA Credential Organization
domain includes: Qualifications Framework
domain includes: Quality Assurance Credential
domain includes: Research Doctorate
domain includes: Secondary Education Certificate
domain includes: Secondary School Diploma
domain includes: Specialist Degree
domain includes: Technical Level 1 Certificate
domain includes: Technical Level 2 Certificate
domain includes: Technical Level 3 Certificate
domain includes: Transfer Agreement
domain includes: Transfer Value Profile
domain includes: Work-Based Learning Certificate
range includes: Academic Certificate
range includes: Alignment Map
range includes: Apprentice Certificate
range includes: Assessment Profile
range includes: Associate Degree
range includes: Associate of Applied Arts Degree
range includes: Associate of Applied Science Degree
range includes: Associate of Arts Degree
range includes: Associate of Science Degree
range includes: Bachelor's Degree
range includes: Bachelor of Arts Degree
range includes: Bachelor of Science Degree
range includes: Badge

Supersedes
type: Property
comment: Resource that this resource replaces.
description: For example, the credential that is outright replaced by the credential being described, and is not simply an older version of the same credential (the two credentials have different CTIDs).
term status: stable
domain includes: Academic Certificate
domain includes: Alignment Map
domain includes: Apprentice Certificate
domain includes: Assessment Profile
domain includes: Associate Degree
domain includes: Associate of Applied Arts Degree
domain includes: Associate of Applied Science Degree
domain includes: Associate of Arts Degree
domain includes: Associate of Science Degree
domain includes: Bachelor's Degree
domain includes: Bachelor of Arts Degree
domain includes: Bachelor of Science Degree
domain includes: Badge
domain includes: Basic Technical Certificate
domain includes: Certificate
domain includes: Certificate of Completion
domain includes: Certificate of Participation
domain includes: Certification
domain includes: Course
domain includes: Credential
domain includes: Credential Organization
domain includes: Credential Type
domain includes: Degree
domain includes: Digital Badge
domain includes: Diploma
domain includes: Doctoral Degree
domain includes: General Education Development (GED)
domain includes: General Education Level 1 Certificate
domain includes: General Education Level 2 Certificate
domain includes: Higher Education Level 1 Certificate
domain includes: Higher Education Level 2 Certificate
domain includes: Journeyman Certificate
domain includes: Learning Opportunity Profile
domain includes: Learning Program
domain includes: License
domain includes: Master Trade Certificate
domain includes: Master's Degree
domain includes: Master of Arts Degree
domain includes: Master of Science Degree
domain includes: Micro-Credential
domain includes: Open Badge
domain includes: Organization
domain includes: Post-Baccalaureate Certificate
domain includes: Post-Master Certificate
domain includes: Pre-Apprenticeship Certificate
domain includes: Prior Learning Policy
domain includes: Professional Certificate
domain includes: Professional Doctorate
domain includes: Proficiency Certificate
domain includes: QA Credential Organization
domain includes: Qualifications Framework
domain includes: Quality Assurance Credential
domain includes: Research Doctorate
domain includes: Secondary Education Certificate
domain includes: Secondary School Diploma
domain includes: Specialist Degree
domain includes: Technical Level 1 Certificate
domain includes: Technical Level 2 Certificate
domain includes: Technical Level 3 Certificate
domain includes: Transfer Agreement
domain includes: Transfer Value Profile
domain includes: Work-Based Learning Certificate
range includes: Academic Certificate
range includes: Alignment Map
range includes: Apprentice Certificate
range includes: Assessment Profile
range includes: Associate Degree
range includes: Associate of Applied Arts Degree
range includes: Associate of Applied Science Degree
range includes: Associate of Arts Degree
range includes: Associate of Science Degree
range includes: Bachelor's Degree
range includes: Bachelor of Arts Degree
range includes: Bachelor of Science Degree
range includes: Badge

Support Service Condition
type: Property
comment: Requirements to qualify for a support service.
term status: unstable
domain includes: Support Service
range includes: Condition Profile

Support Service For
type: Property
comment: Resource to which this support service is applicable.
term status: unstable
domain includes: Support Service
range includes: Academic Certificate
range includes: Apprentice Certificate
range includes: Assessment Profile
range includes: Associate Degree
range includes: Associate of Applied Arts Degree
range includes: Associate of Applied Science Degree
range includes: Associate of Arts Degree
range includes: Associate of Science Degree
range includes: Bachelor's Degree
range includes: Bachelor of Arts Degree
range includes: Bachelor of Science Degree
range includes: Badge
range includes: Basic Technical Certificate
range includes: Certificate
range includes: Certificate of Completion
range includes: Certificate of Participation
range includes: Certification
range includes: Collection
range includes: Course
range includes: Credential
range includes: Degree
range includes: Digital Badge
range includes: Diploma
range includes: Doctoral Degree
range includes: General Education Development (GED)
range includes: General Education Level 1 Certificate
range includes: General Education Level 2 Certificate
range includes: Higher Education Level 1 Certificate
range includes: Higher Education Level 2 Certificate
range includes: Job
range includes: Journeyman Certificate
range includes: Learning Opportunity Profile
range includes: Learning Program
range includes: License
range includes: Master Trade Certificate
range includes: Master's Degree
range includes: Master of Arts Degree
range includes: Master of Science Degree
range includes: Micro-Credential
range includes: Open Badge
range includes: Pathway
range includes: Post-Baccalaureate Certificate
range includes: Post-Master Certificate
range includes: Pre-Apprenticeship Certificate
range includes: Professional Certificate
range includes: Professional Doctorate
range includes: Proficiency Certificate
range includes: Quality Assurance Credential
range includes: Research Doctorate
range includes: Scheduled Offering
range includes: Secondary Education Certificate
range includes: Secondary School Diploma
range includes: Specialist Degree
range includes: Technical Level 1 Certificate
range includes: Technical Level 2 Certificate
range includes: Technical Level 3 Certificate
range includes: Work-Based Learning Certificate
range includes: Work Role

Support Service Statement
type: Property
comment: Webpage or online document that defines or explains the nature of support services offered by the organization.
term status: unstable
domain includes: Credential Organization
domain includes: Organization
domain includes: QA Credential Organization
range includes: WebPage

Support Service Statement Description
type: Property
comment: Description of the nature of support services offered by the organization.
term status: unstable
domain includes: Credential Organization
domain includes: Organization
domain includes: QA Credential Organization
range includes: langString

Support Service Type
type: Property
comment: Types of support services offered by an agent; select from an existing enumeration of such types.
term status: unstable
domain includes: Support Service
range includes: Credential Alignment Object

Target Assessment
type: Property
comment: Assessment that provides direct, indirect, formative or summative evaluation or estimation of the nature, ability, or quality for an entity.
term status: stable
domain includes: Assessment Profile
domain includes: Condition Profile
domain includes: Course
domain includes: Learning Opportunity Profile
domain includes: Learning Program
domain includes: Process Profile
range includes: Assessment
range includes: Assessment Profile

Target Competency
type: Property
comment: A competency relevant to the resource being described.
term status: stable
sub property of: credentialAlignment
domain includes: RubricCriterion
domain includes: Condition Profile
domain includes: Industry
domain includes: Job
domain includes: Occupation
domain includes: Task
domain includes: Work Role
range includes: Competency
range includes: Credential Alignment Object

Target Competency Framework
type: Property
comment: Competency framework relevant to the process being described.
term status: stable
sub property of: credentialAlignment
domain includes: Process Profile
range includes: CompetencyFramework
range includes: Credential Alignment Object

Target Competency Of
type: Property
comment: Resource that targets this Competency for a particular purpose.
term status: unstable
domain includes: Competency
range includes: Academic Certificate
range includes: Apprentice Certificate
range includes: Assessment Profile
range includes: Associate Degree
range includes: Associate of Applied Arts Degree
range includes: Associate of Applied Science Degree
range includes: Associate of Arts Degree
range includes: Associate of Science Degree
range includes: Bachelor's Degree
range includes: Bachelor of Arts Degree
range includes: Bachelor of Science Degree
range includes: Badge
range includes: Basic Technical Certificate
range includes: Certificate
range includes: Certificate of Completion
range includes: Certificate of Participation
range includes: Certification
range includes: Course
range includes: Credential
range includes: Degree
range includes: Digital Badge
range includes: Diploma
range includes: Doctoral Degree
range includes: General Education Development (GED)
range includes: General Education Level 1 Certificate
range includes: General Education Level 2 Certificate
range includes: Higher Education Level 1 Certificate
range includes: Higher Education Level 2 Certificate
range includes: Job
range includes: Journeyman Certificate
range includes: Learning Opportunity Profile
range includes: Learning Program
range includes: License
range includes: Master Trade Certificate
range includes: Master's Degree
range includes: Master of Arts Degree
range includes: Master of Science Degree
range includes: Micro-Credential
range includes: Occupation
range includes: Open Badge
range includes: Post-Baccalaureate Certificate
range includes: Post-Master Certificate
range includes: Pre-Apprenticeship Certificate
range includes: Professional Certificate
range includes: Professional Doctorate
range includes: Proficiency Certificate
range includes: Quality Assurance Credential
range includes: Research Doctorate
range includes: Secondary Education Certificate
range includes: Secondary School Diploma
range includes: Specialist Degree
range includes: Technical Level 1 Certificate
range includes: Technical Level 2 Certificate
range includes: Technical Level 3 Certificate
range includes: Transfer Intermediary
range includes: Work-Based Learning Certificate

Target Component
type: Property
comment: Candidate PathwayComponent for the ComponentCondition.
term status: stable
domain includes: Component Condition
range includes: Assessment Component
range includes: Basic Component
range includes: Cocurricular Component
range includes: Collection Component
range includes: Competency Component
range includes: Course Component
range includes: Credential Component
range includes: Extracurricular Component
range includes: Job Component
range includes: Multi Component
range includes: Work Experience Component

Target Contact Point
type: Property
comment: Options for contacting the organization or person.
term status: stable
domain includes: CredentialPerson
domain includes: Place
range includes: Contact Point
equivalent property: contactPoint

Target Credential
type: Property
comment: Credential that is a focus or target of the condition, process or verification service.
term status: stable
domain includes: Condition Profile
domain includes: Course
domain includes: Learning Opportunity Profile
domain includes: Learning Program
domain includes: Process Profile
domain includes: Verification Service Profile
range includes: Academic Certificate
range includes: Apprentice Certificate
range includes: Associate Degree
range includes: Associate of Applied Arts Degree
range includes: Associate of Applied Science Degree
range includes: Associate of Arts Degree
range includes: Associate of Science Degree
range includes: Bachelor's Degree
range includes: Bachelor of Arts Degree
range includes: Bachelor of Science Degree
range includes: Badge
range includes: Basic Technical Certificate
range includes: Certificate
range includes: Certificate of Completion
range includes: Certificate of Participation
range includes: Certification
range includes: Credential
range includes: Degree
range includes: Digital Badge
range includes: Diploma
range includes: Doctoral Degree
range includes: General Education Development (GED)
range includes: General Education Level 1 Certificate
range includes: General Education Level 2 Certificate
range includes: Higher Education Level 1 Certificate
range includes: Higher Education Level 2 Certificate
range includes: Journeyman Certificate
range includes: License
range includes: Master Trade Certificate
range includes: Master's Degree
range includes: Master of Arts Degree
range includes: Master of Science Degree
range includes: Micro-Credential
range includes: Open Badge
range includes: Post-Baccalaureate Certificate
range includes: Post-Master Certificate
range includes: Pre-Apprenticeship Certificate
range includes: Professional Certificate
range includes: Professional Doctorate
range includes: Proficiency Certificate
range includes: Quality Assurance Credential
range includes: Research Doctorate
range includes: Secondary Education Certificate
range includes: Secondary School Diploma
range includes: Specialist Degree
range includes: Technical Level 1 Certificate
range includes: Technical Level 2 Certificate
range includes: Technical Level 3 Certificate
range includes: Work-Based Learning Certificate

Target Job
type: Property
comment: Job that is the focus or target of this resource.
term status: unstable
domain includes: Condition Profile
range includes: Job

Target Learning Opportunity
type: Property
comment: Learning opportunity that is the focus of a condition, process or another learning opportunity.
term status: stable
domain includes: Condition Profile
domain includes: Course
domain includes: Learning Opportunity Profile
domain includes: Learning Program
domain includes: Process Profile
range includes: Course
range includes: Learning Opportunity
range includes: Learning Opportunity Profile
range includes: Learning Program

Target Learning Resource
type: Property
comment: Learning object or resource that is used as part of a learning activity.
description: Examples include a textbook or lesson plan that describes or records the educational activity (e.g. an audio- or video-recording of a lesson).
term status: stable
domain includes: Assessment Profile
domain includes: Course
domain includes: Learning Opportunity Profile
domain includes: Learning Program
range includes: Learning Resource

Target Node
type: Property
comment: Individual entry in a formally defined framework that is the target of an alignment.
description: The target node returned must be the exact competency or concept being described and no other competency or concept. References to data or a document that returns all of the competencies or concepts in the framework to which the target node belongs should use the ceterms:framework property.
usage note: "Framework" may be interpreted broadly to include any scheme or schema for organizing and referencing resources.
term status: stable
domain includes: Alignment Object
domain includes: Credential Alignment Object
domain includes: FinancialAlignmentObject
range includes: anyURI
equivalent property: targetUrl

Target Description
type: Property
comment: Textual description of an individual entry in a formally defined framework that is the target of an alignment.
usage note: "Framework" may be interpreted broadly to include any scheme or schema for organizing and referencing resources.
term status: stable
domain includes: Alignment Object
domain includes: Credential Alignment Object
domain includes: FinancialAlignmentObject
range includes: langString
equivalent property: targetDescription

Target Node Name
type: Property
comment: Name of an individual entry in a formally defined framework that is the target of an alignment.
usage note: "Framework" may be interpreted broadly to include any scheme or schema for organizing and referencing resources.
term status: stable
domain includes: Alignment Object
domain includes: Credential Alignment Object
domain includes: FinancialAlignmentObject
range includes: langString
equivalent property: targetName

Target Occupation
type: Property
comment: Occupation that is the focus or target of this resource.
term status: unstable
domain includes: Rubric
domain includes: Condition Profile
range includes: Occupation

Target Pathway
type: Property
comment: Pathway in which this resource is a potential component.
term status: stable
domain includes: Academic Certificate
domain includes: Apprentice Certificate
domain includes: Assessment Profile
domain includes: Associate Degree
domain includes: Associate of Applied Arts Degree
domain includes: Associate of Applied Science Degree
domain includes: Associate of Arts Degree
domain includes: Associate of Science Degree
domain includes: Bachelor's Degree
domain includes: Bachelor of Arts Degree
domain includes: Bachelor of Science Degree
domain includes: Badge
domain includes: Basic Technical Certificate
domain includes: Certificate
domain includes: Certificate of Completion
domain includes: Certificate of Participation
domain includes: Certification
domain includes: Course
domain includes: Credential
domain includes: Credential Type
domain includes: Degree
domain includes: Digital Badge
domain includes: Diploma
domain includes: Doctoral Degree
domain includes: General Education Development (GED)
domain includes: General Education Level 1 Certificate
domain includes: General Education Level 2 Certificate
domain includes: Higher Education Level 1 Certificate
domain includes: Higher Education Level 2 Certificate
domain includes: Journeyman Certificate
domain includes: Learning Opportunity Profile
domain includes: Learning Program
domain includes: License
domain includes: Master Trade Certificate
domain includes: Master's Degree
domain includes: Master of Arts Degree
domain includes: Master of Science Degree
domain includes: Micro-Credential
domain includes: Open Badge
domain includes: Post-Baccalaureate Certificate
domain includes: Post-Master Certificate
domain includes: Pre-Apprenticeship Certificate
domain includes: Professional Certificate
domain includes: Professional Doctorate
domain includes: Proficiency Certificate
domain includes: Quality Assurance Credential
domain includes: Research Doctorate
domain includes: Secondary Education Certificate
domain includes: Secondary School Diploma
domain includes: Specialist Degree
domain includes: Technical Level 1 Certificate
domain includes: Technical Level 2 Certificate
domain includes: Technical Level 3 Certificate
domain includes: Work-Based Learning Certificate
range includes: Pathway

Target Task
type: Property
comment: Task that is the focus or target of this resource.
term status: unstable
domain includes: RubricCriterion
domain includes: Condition Profile
range includes: Task

Teaches
type: Property
comment: Competency that the learning opportunity is intended to teach.
term status: stable
sub property of: Target Competency
domain includes: Course
domain includes: Learning Opportunity Profile
domain includes: Learning Program
range includes: Competency
range includes: Credential Alignment Object

Telephone
type: Property
comment: Telephone number.
term status: stable
domain includes: Contact Point
range includes: string
equivalent property: telephone

Temporal Coverage
type: Property
comment: Indicates the time period to which the entity's content applies or during which it occurres.
description: In the CTDL, the ceterms:temporalCoverage property serves as a super-property for an array of sub-properties defining time-dependent aspects of a resource.
term status: stable
range includes: date
equivalent property: temporalCoverage

Time Required
type: Property
comment: Total engaged or participating time it will take to complete the activity, event, or resource.
description: This is intended to indicate only the sum of the individual amounts of time which are spent actively engaged in pursuing the completion of the activity, event, or resource, regardless of the overall time span required to complete it.
usage note: If a resource takes 50 hours over a span of 6 months to complete, use this to record 50 hours as PT50H.
term status: unstable
domain includes: Duration Profile
range includes: Duration

Transfer Value
type: Property
comment: An explicit amount of transfer value.
term status: stable
domain includes: Transfer Value Profile
range includes: Value Profile

Transfer Value For
type: Property
comment: Resource for which the described transfer value is applicable.
description: When this property references multiple resources, those resources should be treated as a set for which, collectively, the transfer value is applicable.
term status: stable
domain includes: Transfer Value Profile
range includes: Competency
range includes: Academic Certificate
range includes: Apprentice Certificate
range includes: Assessment Profile
range includes: Associate Degree
range includes: Associate of Applied Arts Degree
range includes: Associate of Applied Science Degree
range includes: Associate of Arts Degree
range includes: Associate of Science Degree
range includes: Bachelor's Degree
range includes: Bachelor of Arts Degree
range includes: Bachelor of Science Degree
range includes: Badge
range includes: Basic Technical Certificate
range includes: Certificate
range includes: Certificate of Completion
range includes: Certificate of Participation
range includes: Certification
range includes: Course
range includes: Credential
range includes: Degree
range includes: Digital Badge
range includes: Diploma
range includes: Doctoral Degree
range includes: General Education Development (GED)
range includes: General Education Level 1 Certificate
range includes: General Education Level 2 Certificate
range includes: Higher Education Level 1 Certificate
range includes: Higher Education Level 2 Certificate
range includes: Job
range includes: Journeyman Certificate
range includes: Learning Opportunity Profile
range includes: Learning Program
range includes: License
range includes: Master Trade Certificate
range includes: Master's Degree
range includes: Master of Arts Degree
range includes: Master of Science Degree
range includes: Micro-Credential
range includes: Occupation
range includes: Open Badge
range includes: Post-Baccalaureate Certificate
range includes: Post-Master Certificate
range includes: Pre-Apprenticeship Certificate
range includes: Professional Certificate
range includes: Professional Doctorate
range includes: Proficiency Certificate
range includes: Quality Assurance Credential
range includes: Research Doctorate
range includes: Secondary Education Certificate
range includes: Secondary School Diploma
range includes: Specialist Degree
range includes: Technical Level 1 Certificate
range includes: Technical Level 2 Certificate
range includes: Technical Level 3 Certificate
range includes: Work-Based Learning Certificate

Transfer Value From
type: Property
comment: Resource from which the described transfer value originates.
description: When this property references multiple resources, those resources should be treated as a set from which, collectively, the transfer value originates.
term status: stable
domain includes: Transfer Value Profile
range includes: Competency
range includes: Academic Certificate
range includes: Apprentice Certificate
range includes: Assessment Profile
range includes: Associate Degree
range includes: Associate of Applied Arts Degree
range includes: Associate of Applied Science Degree
range includes: Associate of Arts Degree
range includes: Associate of Science Degree
range includes: Bachelor's Degree
range includes: Bachelor of Arts Degree
range includes: Bachelor of Science Degree
range includes: Badge
range includes: Basic Technical Certificate
range includes: Certificate
range includes: Certificate of Completion
range includes: Certificate of Participation
range includes: Certification
range includes: Course
range includes: Credential
range includes: Degree
range includes: Digital Badge
range includes: Diploma
range includes: Doctoral Degree
range includes: General Education Development (GED)
range includes: General Education Level 1 Certificate
range includes: General Education Level 2 Certificate
range includes: Higher Education Level 1 Certificate
range includes: Higher Education Level 2 Certificate
range includes: Job
range includes: Journeyman Certificate
range includes: Learning Opportunity Profile
range includes: Learning Program
range includes: License
range includes: Master Trade Certificate
range includes: Master's Degree
range includes: Master of Arts Degree
range includes: Master of Science Degree
range includes: Micro-Credential
range includes: Occupation
range includes: Open Badge
range includes: Post-Baccalaureate Certificate
range includes: Post-Master Certificate
range includes: Pre-Apprenticeship Certificate
range includes: Professional Certificate
range includes: Professional Doctorate
range includes: Proficiency Certificate
range includes: Quality Assurance Credential
range includes: Research Doctorate
range includes: Secondary Education Certificate
range includes: Secondary School Diploma
range includes: Specialist Degree
range includes: Technical Level 1 Certificate
range includes: Technical Level 2 Certificate
range includes: Technical Level 3 Certificate
range includes: Work-Based Learning Certificate

Transfer Value Statement
type: Property
comment: Webpage or online document that defines or explains the nature of transfer value handled by the organization.
term status: stable
domain includes: Credential Organization
domain includes: Organization
domain includes: QA Credential Organization
range includes: anyURI

Transfer Value Statement Description
type: Property
comment: Description of the nature of transfer value handled by the organization.
term status: stable
domain includes: Credential Organization
domain includes: Organization
domain includes: QA Credential Organization
range includes: langString

Uses Verification Service
type: Property
comment: Reference to a service that is used to verify this Credential or type of credential.
term status: unstable
domain includes: Academic Certificate
domain includes: Apprentice Certificate
domain includes: Associate Degree
domain includes: Associate of Applied Arts Degree
domain includes: Associate of Applied Science Degree
domain includes: Associate of Arts Degree
domain includes: Associate of Science Degree
domain includes: Bachelor's Degree
domain includes: Bachelor of Arts Degree
domain includes: Bachelor of Science Degree
domain includes: Badge
domain includes: Basic Technical Certificate
domain includes: Certificate
domain includes: Certificate of Completion
domain includes: Certificate of Participation
domain includes: Certification
domain includes: Credential
domain includes: Credential Type
domain includes: Degree
domain includes: Digital Badge
domain includes: Diploma
domain includes: Doctoral Degree
domain includes: General Education Development (GED)
domain includes: General Education Level 1 Certificate
domain includes: General Education Level 2 Certificate
domain includes: Higher Education Level 1 Certificate
domain includes: Higher Education Level 2 Certificate
domain includes: Journeyman Certificate
domain includes: License
domain includes: Master Trade Certificate
domain includes: Master's Degree
domain includes: Master of Arts Degree
domain includes: Master of Science Degree
domain includes: Micro-Credential
domain includes: Open Badge
domain includes: Post-Baccalaureate Certificate
domain includes: Post-Master Certificate
domain includes: Pre-Apprenticeship Certificate
domain includes: Professional Certificate
domain includes: Professional Doctorate
domain includes: Proficiency Certificate
domain includes: Quality Assurance Credential
domain includes: Research Doctorate
domain includes: Secondary Education Certificate
domain includes: Secondary School Diploma
domain includes: Specialist Degree
domain includes: Technical Level 1 Certificate
domain includes: Technical Level 2 Certificate
domain includes: Technical Level 3 Certificate
domain includes: Work-Based Learning Certificate
range includes: Verification Service Profile

Verification Directory
type: Property
comment: Directory of credential holders and their current statuses.
term status: stable
domain includes: Verification Service Profile
range includes: anyURI

Verification Method Description
type: Property
comment: Textual description of the methods used to evaluate an assessment, learning opportunity, process or verificaiton service for validity or reliability.
term status: stable
domain includes: Process Profile
domain includes: Verification Service Profile
range includes: langString

Verification Service URL
type: Property
comment: Direct access to the verification service.
description: This property identifies machine-accessible services, such as API endpoints, that provide direct access to the verification service being described.
usage note: For general webpages describing the service, use the subjectWebpage property.
term status: stable
domain includes: Verification Service Profile
range includes: anyURI

Verified Claim Type
type: Property
comment: Type of claim provided through a verification service; select from an existing enumeration of such types.
usage note: Best practice for developing credential descriptions for the Credential Engine Registry is to use the ceterms:ClaimType vocabulary.
term status: stable
domain includes: Verification Service Profile
range includes: Credential Alignment Object

Version Code
type: Property
comment: Alphanumeric identifier of the version of the resource that is unique within the organizational context of its owner and which does not need the context of other information in order to be interpreted.
usage note: Intended for simple string and/or numeric version codes or identifiers, such as "10" or "3B.1" or "2024 Release". For version identifiers that need to reference additional information, such as a type of version or framework for versioning, use versionIdentifier.
term status: unstable
domain includes: Competency
domain includes: CompetencyFramework
domain includes: Rubric
domain includes: Academic Certificate
domain includes: Alignment Map
domain includes: Apprentice Certificate
domain includes: Assessment Profile
domain includes: Associate Degree
domain includes: Associate of Applied Arts Degree
domain includes: Associate of Applied Science Degree
domain includes: Associate of Arts Degree
domain includes: Associate of Science Degree
domain includes: Bachelor's Degree
domain includes: Bachelor of Arts Degree
domain includes: Bachelor of Science Degree
domain includes: Badge
domain includes: Basic Technical Certificate
domain includes: Certificate
domain includes: Certificate of Completion
domain includes: Certificate of Participation
domain includes: Certification
domain includes: Collection
domain includes: Course
domain includes: Credential
domain includes: Credential Type
domain includes: Degree
domain includes: Digital Badge
domain includes: Diploma
domain includes: Doctoral Degree
domain includes: General Education Development (GED)
domain includes: General Education Level 1 Certificate
domain includes: General Education Level 2 Certificate
domain includes: Higher Education Level 1 Certificate
domain includes: Higher Education Level 2 Certificate
domain includes: Industry
domain includes: Job
domain includes: Journeyman Certificate
domain includes: Learning Opportunity Profile
domain includes: Learning Program
domain includes: License
domain includes: Master Trade Certificate
domain includes: Master's Degree
domain includes: Master of Arts Degree
domain includes: Master of Science Degree
domain includes: Micro-Credential
domain includes: Occupation
domain includes: Open Badge
domain includes: Pathway
domain includes: Post-Baccalaureate Certificate
domain includes: Post-Master Certificate
domain includes: Pre-Apprenticeship Certificate
domain includes: Prior Learning Policy
domain includes: Professional Certificate
domain includes: Professional Doctorate
domain includes: Proficiency Certificate
domain includes: Qualifications Framework
domain includes: Quality Assurance Credential
domain includes: Research Doctorate
domain includes: Secondary Education Certificate
domain includes: Secondary School Diploma
domain includes: Specialist Degree
domain includes: Task
domain includes: Technical Level 1 Certificate
domain includes: Technical Level 2 Certificate
domain includes: Technical Level 3 Certificate
domain includes: Transfer Agreement
domain includes: Transfer Value Profile
domain includes: Work-Based Learning Certificate
domain includes: Work Role
range includes: string

Version Identifier
type: Property
comment: Alphanumeric identifier of the version of the resource and information about the identifier's originating context or scheme.
usage note: Use versionCode for any local identifier of the version of the resource that come from the organizational context its owner and which do not need the context of other information in order to be interpreted.
term status: stable
domain includes: Competency
domain includes: CompetencyFramework
domain includes: Rubric
domain includes: Academic Certificate
domain includes: Alignment Map
domain includes: Apprentice Certificate
domain includes: Assessment Profile
domain includes: Associate Degree
domain includes: Associate of Applied Arts Degree
domain includes: Associate of Applied Science Degree
domain includes: Associate of Arts Degree
domain includes: Associate of Science Degree
domain includes: Bachelor's Degree
domain includes: Bachelor of Arts Degree
domain includes: Bachelor of Science Degree
domain includes: Badge
domain includes: Basic Technical Certificate
domain includes: Certificate
domain includes: Certificate of Completion
domain includes: Certificate of Participation
domain includes: Certification
domain includes: Collection
domain includes: Course
domain includes: Credential
domain includes: Credential Type
domain includes: Degree
domain includes: Digital Badge
domain includes: Diploma
domain includes: Doctoral Degree
domain includes: General Education Development (GED)
domain includes: General Education Level 1 Certificate
domain includes: General Education Level 2 Certificate
domain includes: Higher Education Level 1 Certificate
domain includes: Higher Education Level 2 Certificate
domain includes: Industry
domain includes: Job
domain includes: Journeyman Certificate
domain includes: Learning Opportunity Profile
domain includes: Learning Program
domain includes: License
domain includes: Master Trade Certificate
domain includes: Master's Degree
domain includes: Master of Arts Degree
domain includes: Master of Science Degree
domain includes: Micro-Credential
domain includes: Occupation
domain includes: Open Badge
domain includes: Pathway
domain includes: Post-Baccalaureate Certificate
domain includes: Post-Master Certificate
domain includes: Pre-Apprenticeship Certificate
domain includes: Prior Learning Policy
domain includes: Professional Certificate
domain includes: Professional Doctorate
domain includes: Proficiency Certificate
domain includes: Qualifications Framework
domain includes: Quality Assurance Credential
domain includes: Research Doctorate
domain includes: Secondary Education Certificate
domain includes: Secondary School Diploma
domain includes: Specialist Degree
domain includes: Task
domain includes: Technical Level 1 Certificate
domain includes: Technical Level 2 Certificate
domain includes: Technical Level 3 Certificate
domain includes: Transfer Agreement
domain includes: Transfer Value Profile
domain includes: Work-Based Learning Certificate
domain includes: Work Role
range includes: Identifier Value

Weight
type: Property
comment: Measurement of the weight, degree, percent, or strength of a recommendation, requirement, or comparison.
usage note: Best practice is to assign a decimal value weight between 0 and 1 that indicates the strength of the assertion, with 0 being weakest and 1 being strongest.
term status: stable
domain includes: Alignment Object
domain includes: Condition Profile
domain includes: Credential Alignment Object
domain includes: FinancialAlignmentObject
range includes: float

Works For
type: Property
comment: Person's place of employment.
term status: stable
domain includes: CredentialPerson
range includes: Credential Organization
range includes: Organization
range includes: QA Credential Organization
equivalent property: worksFor

Years of Experience
type: Property
comment: Years of relevant experience.
usage note: Non-integer year values may be expressed as point value, for example, 0.25, 1.5, etc.
term status: stable
domain includes: Condition Profile
range includes: float

Same As
type: Property
comment: Links an individual to an individual; such an owl:sameAs statement indicates that two URI references actually refer to the same thing: the individuals have the same "identity".
term status: unstable
domain includes: Resource
range includes: Resource

Data Collection Method Type
type: Property
comment: Type of method by which the data was collected.
term status: stable
domain includes: Process Profile
range includes: Concept

Data Provider
type: Property
comment: Credentialing organization or a third party providing the data.
term status: stable
domain includes: DataSetProfile
range includes: Credential Organization
range includes: Organization
range includes: QA Credential Organization

Percentage
type: Property
comment: Quotient of two values of the data set, expressed as a percentage.
usage note: Best practice is to treat the value of this property as a verbatim percentage; for example, a value of 1.5 should be interpreted as 1.5%
term status: stable
domain includes: CriterionLevel
domain includes: Value Profile
domain includes: Observation
domain includes: Quantitative Value
range includes: float

Relevant Data Set
type: Property
comment: Data Set on which earnings or employment data is based.
term status: stable
domain includes: Academic Certificate
domain includes: Apprentice Certificate
domain includes: Assessment Profile
domain includes: Associate Degree
domain includes: Associate of Applied Arts Degree
domain includes: Associate of Applied Science Degree
domain includes: Associate of Arts Degree
domain includes: Associate of Science Degree
domain includes: Bachelor's Degree
domain includes: Bachelor of Arts Degree
domain includes: Bachelor of Science Degree
domain includes: Badge
domain includes: Basic Technical Certificate
domain includes: Certificate
domain includes: Certificate of Completion
domain includes: Certificate of Participation
domain includes: Certification
domain includes: Course
domain includes: Credential
domain includes: Credential Organization
domain includes: Credential Type
domain includes: Degree
domain includes: Digital Badge
domain includes: Diploma
domain includes: Doctoral Degree
domain includes: General Education Development (GED)
domain includes: General Education Level 1 Certificate
domain includes: General Education Level 2 Certificate
domain includes: Higher Education Level 1 Certificate
domain includes: Higher Education Level 2 Certificate
domain includes: Industry
domain includes: Job
domain includes: Journeyman Certificate
domain includes: Learning Opportunity Profile
domain includes: Learning Program
domain includes: License
domain includes: Master Trade Certificate
domain includes: Master's Degree
domain includes: Master of Arts Degree
domain includes: Master of Science Degree
domain includes: Micro-Credential
domain includes: Occupation
domain includes: Open Badge
domain includes: Organization
domain includes: Pathway
domain includes: Post-Baccalaureate Certificate
domain includes: Post-Master Certificate
domain includes: Pre-Apprenticeship Certificate
domain includes: Professional Certificate
domain includes: Professional Doctorate
domain includes: Proficiency Certificate
domain includes: QA Credential Organization
domain includes: Quality Assurance Credential
domain includes: Research Doctorate
domain includes: Secondary Education Certificate
domain includes: Secondary School Diploma
domain includes: Specialist Degree
domain includes: Technical Level 1 Certificate
domain includes: Technical Level 2 Certificate
domain includes: Technical Level 3 Certificate
domain includes: Work-Based Learning Certificate
range includes: DataSetProfile

Description
type: Property
comment: A description of the item.
term status: stable
domain includes: Value Profile
domain includes: MonetaryAmount
domain includes: Quantitative Value
range includes: langString

Maximum Value
type: Property
comment: The upper value of some characteristic or property.
usage note: In CTDL: for single values, use schema:value; for ranges, use schema:minValue and schema:maxValue.
term status: stable
domain includes: CriterionLevel
domain includes: Value Profile
domain includes: Observation
domain includes: MonetaryAmount
domain includes: Quantitative Value
range includes: float

Minimum Value
type: Property
comment: The lower value of some characteristic or property.
usage note: In CTDL: for single values, use schema:value; for ranges, use schema:minValue and schema:maxValue.
term status: stable
domain includes: CriterionLevel
domain includes: Value Profile
domain includes: Observation
domain includes: MonetaryAmount
domain includes: Quantitative Value
range includes: float

Subject Of
type: Property
comment: A CreativeWork or Event about this Thing.
term status: unstable
domain includes: Qualifications Framework
range includes: anyURI

Unit Text
type: Property
comment: A string or text indicating the unit of measurement.
term status: stable
domain includes: MonetaryAmount
domain includes: Quantitative Value
range includes: Credential Alignment Object
range includes: Concept

Value
type: Property
comment: The value of the property value node.
usage note: In CTDL: for single values, use schema:value; for ranges, use schema:minValue and schema:maxValue.
term status: stable
domain includes: CriterionLevel
domain includes: Value Profile
domain includes: Observation
domain includes: MonetaryAmount
domain includes: Quantitative Value
range includes: float

Accommodation
type: ConceptScheme
comment: Types of features, changes, modifications, or adjustments made to a facility, service, or resource to provide equal access and opportunity to people with diverse needs and preferences.
description: These accommodations can include existing physical features or modifications to the environment, alternative formats or modes of communication, flexible scheduling, and personal assistance services, among others.
term status: unstable
has top concept: Facility Accommodation
has top concept: Resource and Service Accommodation

Action Status
type: ConceptScheme
comment: Types of current status of an action.
description: Available statuses include ActiveActionStatus, CompletedActionStatus, FailedActionStatus, PotentialActionStatus.
term status: stable
has top concept: Active Action Status
has top concept: Completed Action Status
has top concept: Failed Action Status
has top concept: Potential Action Status

Agent Sector
type: ConceptScheme
comment: Types of sociological, economic, or political subdivision of society.
description: Sectors include public, private for profit, public for profit, and business industry association.
term status: stable
has top concept: Private For-Profit
has top concept: Private Not-For-Profit
has top concept: Public

Agent Service Type
type: ConceptScheme
comment: Types of services offered by an agent.
term status: stable
has top concept: Accredit Service
has top concept: Approve Service
has top concept: Offer Service
has top concept: Recognize Service
has top concept: Regulate Service
has top concept: Renew Service
has top concept: Revoke Service

Agreement Category
type: ConceptScheme
comment: Concepts classifying formal mechanisms used to recognize or transfer learning across organizations or programs.
term status: unstable
has top concept: Articulation Agreement
has top concept: Memorandum of Understanding
has top concept: Multiparty Agreement
has top concept: Standing Transfer Arrangement

Alignment
type: ConceptScheme
comment: Types of relationship that can be asserted as existing between nodes in frameworks.
term status: unstable
has top concept: Broad Match
has top concept: Close Match
has top concept: Exact Match
has top concept: Narrow Match
has top concept: No Match
has top concept: Related Match

Array Operation Category
type: ConceptScheme
comment: Concepts describing an action to be taken on an array of values.
usage note: Used in CTDL for actions performed on arrays, lists or sets or values in order to obtain some other value.
term status: unstable
has top concept: All Of
has top concept: Any Of
has top concept: Count Distinct
has top concept: Maximum
has top concept: Mean
has top concept: Minimum
has top concept: One Of
has top concept: Sum

Assessment Method
type: ConceptScheme
comment: Types of assessment method.
term status: stable
has top concept: Artifact
has top concept: Exam
has top concept: Performance

Assessment Use
type: ConceptScheme
comment: Types of Intended uses of an assessment.
term status: stable
has top concept: Formative Assessment
has top concept: Summative Assessment

Audience
type: ConceptScheme
comment: Types of audiences for which the resource being described is applicable or available.
description: If the resource is applicable or available for any type of audience, do not select anything.
term status: stable
has top concept: Citizen
has top concept: Cultural/Ethnic Minority
has top concept: Currently Incarcerated
has top concept: Current Military
has top concept: Current Military Dependent
has top concept: Current Military Spouse
has top concept: Current Student
has top concept: Displaced
has top concept: Formerly Incarcerated
has top concept: Former Member
has top concept: Former Military / Veteran
has top concept: Former Military Dependent
has top concept: Former Military Spouse
has top concept: Former Student / Alumni
has top concept: Full-Time
has top concept: Future Member
has top concept: Future Student
has top concept: Homemaker
has top concept: Job Seeker
has top concept: Member
has top concept: Non-Citizen
has top concept: Non-Member
has top concept: Non-Resident
has top concept: Part-Time
has top concept: Private Employee
has top concept: Public Employee
has top concept: Resident
has top concept: Unemployed
has top concept: Youth

Audience Level
type: ConceptScheme
comment: Types of levels in an academic or training progression expected of, or to be developed by, the typical person for the resource being described.
term status: stable
has top concept: Advanced Level
has top concept: Beginner Level
has top concept: Graduate Level
has top concept: Intermediate Level
has top concept: Lower Division Level
has top concept: Post-Secondary Level
has top concept: Professional Level
has top concept: Remedial Level
has top concept: Secondary School or Equivalent
has top concept: Undergraduate Level
has top concept: Upper Division Level

Claim Type
type: ConceptScheme
comment: Types of the claims supported by a verification service.
term status: stable
has top concept: Badge Claim
has top concept: Quality Assurance Claim
has top concept: Transcript Claim
has top concept: Verifiedclaim
has top concept: Verified Claim

Collection Category
type: ConceptScheme
comment: Types of collection, list, or array that groups together other resources.
term status: unstable
has top concept: Eligible Training Providers List
has top concept: GI Bill
has top concept: Industry Recognized
has top concept: Perkins
has top concept: Promise Scholarship
has top concept: Quality
has top concept: State Approved Postsecondary Programs

Comparator Category
type: ConceptScheme
comment: Concepts for comparing two values.
usage note: Used in CTDL constraints as values of the ceterms:comparator property to make a comparison that should yield true or false. In all cases the left source of data is compared to the right source, sometimes the comparison is made after an action is applied, e.g. finding the mean of several numbers.
term status: unstable
has top concept: Equal To
has top concept: Greater Than
has top concept: Greater Than or Equal To
has top concept: Less Than
has top concept: Less Than or Equal To
has top concept: Not Equal To

Cost Type
type: ConceptScheme
comment: Entity that describes the types of costs related to earning or completing a credential, assessment, or learning opportunity.
description: Attainment costs do not include living (e.g., room and board) or travel expenses.
term status: stable
has top concept: Aggregate Cost
has top concept: Application
has top concept: Background Check
has top concept: Enrollment Fee
has top concept: Graduation Fee
has top concept: Learning Resource
has top concept: Meals
has top concept: Mixed Fees
has top concept: Optional Charges
has top concept: Processing Fee
has top concept: Program Specific Fee
has top concept: Reexamination Fee
has top concept: Maintenance Fee
has top concept: Rescheduling Fee
has top concept: Room or Residence
has top concept: Scoring Fee
has top concept: Standalone/Extra Assessment
has top concept: Student Services Fee
has top concept: Technology Fee
has top concept: Tuition

Credential Status
type: ConceptScheme
comment: Types of applicability statuses of a credential.
term status: stable
has top concept: Active
has top concept: Ceasing
has top concept: Deprecated
has top concept: Probationary
has top concept: Superseded
has top concept: Suspended
has top concept: Teach Out

Credit Unit
type: ConceptScheme
comment: Broad descriptions of units used to measure credit associated with a resource.
term status: stable
has top concept: Time-Based Credit
has top concept: Type-Based Credit

Delivery Type
type: ConceptScheme
comment: Types of technical form for providing instances of the entity.
term status: stable
has top concept: Blended Delivery
has top concept: In-Person Only
has top concept: Online Only
has top concept: Variable Site

External Input
type: ConceptScheme
comment: Types of external stakeholders that provide input to the process.
term status: stable
has top concept: Professional Associations
has top concept: Business
has top concept: Business or Industry Association
has top concept: Consumers
has top concept: Education Administrators
has top concept: Educators
has top concept: Subject Matter Experts
has top concept: Governments
has top concept: Guardians
has top concept: International Bodies
has top concept: Practitioners
has top concept: Public
has top concept: Students

Financial Assistance
type: ConceptScheme
comment: Types of financial assistance typically available in the United States.
term status: stable
has top concept: General Financial Assistance
has top concept: Military

Learning Method
type: ConceptScheme
comment: Types of methods used to conduct the learning opportunity.
term status: stable
has top concept: Applied Instruction
has top concept: Augmented Reality
has top concept: Cohort-Based
has top concept: ElectronicMediaBased
has top concept: Gaming
has top concept: Laboratory
has top concept: Lecture
has top concept: Prerecorded
has top concept: Self Paced
has top concept: Seminar
has top concept: Simulation
has top concept: Work Based

Learning Recognition Evidence Category
type: ConceptScheme
comment: Concepts describing types of evidence accepted for learning recognition evaluation.
term status: unstable
has top concept: Assessment Score
has top concept: Completion Record
has top concept: Credential
has top concept: Credit Recommendation
has top concept: Employer Attestation
has top concept: Hours Verification
has top concept: Job Verification
has top concept: Military Transcript
has top concept: Portfolio
has top concept: Reflective Narrative
has top concept: Résumé Verification
has top concept: Skill Profile
has top concept: Syllabus
has top concept: Transcript
has top concept: Workplace Learning Record
has top concept: Work Product

Learning Recognition Method Category
type: ConceptScheme
comment: Concepts describing methods used to evaluate and recognize learning.
term status: unstable
has top concept: Credit Recommendation Review
has top concept: External Training Evaluation
has top concept: Faculty-Developed Examination
has top concept: Faculty Transfer Evaluation
has top concept: Individualized Prior Learning Assessment
has top concept: Institution-Developed Assessment
has top concept: International Credit Evaluation
has top concept: Portfolio Assessment
has top concept: Prior Learning Assessment
has top concept: Proficiency Examination
has top concept: Standardized Examination
has top concept: Transcript Evaluation
has top concept: Transfer Credit Evaluation

Learning Recognition Outcome Category
type: ConceptScheme
comment: Concepts describing outcomes of learning recognition.
term status: unstable
has top concept: Advanced Standing
has top concept: Credit Awarded
has top concept: Credit Equivalency
has top concept: Eligibility Met
has top concept: Exemption Waiver
has top concept: Not Recognized
has top concept: Placement
has top concept: Recognition Only

Learning Recognition Source Category
type: ConceptScheme
comment: Concepts describing formal, non-formal, or informal contexts from which learning may be recognized for applicability toward requirements.
term status: unstable
has top concept: Apprenticeship
has top concept: Clinical Practicum
has top concept: Community-Based Organization Training
has top concept: Community Service
has top concept: Continuing Education
has top concept: Cooperative Education
has top concept: Course
has top concept: Custodial Education
has top concept: Degree
has top concept: Dual Enrollment
has top concept: Employment-Based Training
has top concept: Exam
has top concept: Experiential Learning

Life Cycle Status
type: ConceptScheme
comment: Types of states of a resource in terms of its stage in a life cycle.
term status: unstable
has top concept: Active
has top concept: Ceased
has top concept: Ceasing
has top concept: Developing
has top concept: Suspended

Logical Operator Category
type: ConceptScheme
comment: Logical operators applicable to two or more items.
usage note: Used in CTDL for types of logical operator for combining two or more nested ComponentCondition entities, Constraint entities, or a mix of ComponentCondition and Constraint entities.
term status: unstable
has top concept: And
has top concept: Only One
has top concept: Or

Organization Type
type: ConceptScheme
comment: Types of organization.
term status: stable
has top concept: Assessment Body
has top concept: Business
has top concept: Business or Industry Association
has top concept: Certification Body
has top concept: Collaborative
has top concept: Coordinating Body
has top concept: Government Agency
has top concept: Labor Union
has top concept: Military
has top concept: Postsecondary Educational Institution
has top concept: Primarily Online
has top concept: Primary School
has top concept: Professional Association
has top concept: Quality Assurance Body
has top concept: Secondary School
has top concept: Education and Training Provider
has top concept: Vendor

Residency
type: ConceptScheme
comment: Types of residency.
term status: stable
has top concept: In-State
has top concept: Foreign/International
has top concept: Local
has top concept: Out-of-State
has top concept: Regional

Schedule Frequency
type: ConceptScheme
comment: Types for how often events occur.
term status: unstable
has top concept: Annually
has top concept: Bi-Monthly
has top concept: Event-Based
has top concept: Irregular
has top concept: Monthly
has top concept: Multiple Per Week
has top concept: On-Demand
has top concept: Open Entry/Exit
has top concept: Quarterly
has top concept: Self-Paced
has top concept: Semi-Annually
has top concept: Single Instance
has top concept: Weekly

Schedule Timing
type: ConceptScheme
comment: Types for when (in time) events occur.
term status: unstable
has top concept: Daytime
has top concept: Evening
has top concept: Weekdays
has top concept: Weekends

Scoring Method
type: ConceptScheme
comment: Types of applicable scoring.
term status: stable
has top concept: Criterion-Referenced
has top concept: Norm-Referenced

Statement Category
type: ConceptScheme
comment: Concepts used to classify the nature or purpose of structured statements.
usage note: If a more granular or precise classification is required for local purposes than is available in this concept scheme, best practice is to publish a description of it as a skos:Concept and to use it alongside the best match broader category in this scheme.
term status: unstable
has top concept: Development Related
has top concept: Equivalency Request Related
has top concept: Guarantee
has top concept: Learning Recognition Evidence Related
has top concept: Learning Recognition Method Related
has top concept: Learning Recognition Outcome Related
has top concept: Learning Recognition Request Related
has top concept: Learning Recognition Source Related
has top concept: Limitation
has top concept: Marketing Related
has top concept: Metric Related
has top concept: Notice Period
has top concept: Obligation
has top concept: Overview
has top concept: Purpose
has top concept: Termination Terms

Support Service Category
type: ConceptScheme
comment: Types of support services to help people succeed in their education and career goals.
term status: unstable
has top concept: Academic Advising
has top concept: Assistive Technology Support
has top concept: Audiological Health Care
has top concept: Behavioral Service
has top concept: Benefits Support
has top concept: Career Advising
has top concept: Career Assessment
has top concept: Career Exploration
has top concept: Case Management
has top concept: Chatbot
has top concept: Childcare
has top concept: Clothing Assistance
has top concept: Computer Hub
has top concept: Counseling
has top concept: Credit Transfer Tool
has top concept: Crisis Support
has top concept: Diversity Equity Inclusion
has top concept: Equipment Provision
has top concept: Financial Literacy
has top concept: Frequently Asked Questions
has top concept: Health Care
has top concept: Immigration Assistance
has top concept: Internet Access
has top concept: Job Placement
has top concept: Learning Resource Provision
has top concept: Legal Service
has top concept: Mental Health Counseling
has top concept: Mentoring
has top concept: Networking
has top concept: Neurodivergence Service
has top concept: Note Taking Assistance
has top concept: Peer Service
has top concept: Personal Assistance
has top concept: Portfolio Advising
has top concept: Postal Address
has top concept: Prior Learning Assessment Advising
has top concept: Psychological Service
has top concept: Public Benefits Case Management
has top concept: Reader Service
has top concept: Rehabilitation
has top concept: Residential Living
has top concept: Respite Care
has top concept: Sign Language
has top concept: Skill Mapping
has top concept: Study Skills
has top concept: Substance Abuse Prevention
has top concept: Support Coordination
has top concept: Supported Work
has top concept: Talent Marketplace Signaling
has top concept: Technology Lending
has top concept: Test Assistance
has top concept: Transfer Admission
has top concept: Transfer Advising
has top concept: Transfer Equivalency Tool
has top concept: Transfer Outreach Event
has top concept: Transfer Timeline
has top concept: Translation
has top concept: Transportation
has top concept: Tutoring
has top concept: Vision Service

Accessible Housing
type: Concept
definition: Housing with features, modifications, or adjustments to ensure that individuals with disabilities can access and use the space on an equal basis with others.
term status: unstable
broader: Facility Accommodation
in scheme: Accommodation

Accessible Parking
type: Concept
definition: A designated parking spot close to a building entrance, with adequate space to allow for accessible van or car parking, and with appropriate signage and markings.
term status: unstable
broader: Facility Accommodation
in scheme: Accommodation

Accessible Restroom
type: Concept
definition: Accessible restrooms with grab bars, accessible toilets, and sinks at different heights.
term status: unstable
broader: Facility Accommodation
in scheme: Accommodation

Adjustable Lighting
type: Concept
definition: Adjustable lighting levels and glare reduction.
term status: unstable
broader: Facility Accommodation
in scheme: Accommodation

Adjustable Workstations
type: Concept
definition: Adjustable counters and workstations.
term status: unstable
broader: Facility Accommodation
in scheme: Accommodation

Alternative Formats
type: Concept
definition: Alternative formats for print and display materials.
description: Examples include large print books or accessible PDFs.
term status: unstable
broader: Resource and Service Accommodation
in scheme: Accommodation

Assistive Technology
type: Concept
definition: Assistive technology and software to enable or improve access.
term status: unstable
broader: Resource and Service Accommodation
in scheme: Accommodation

Audio Captioning
type: Concept
definition: Displays for text corresponding to spoken words and audio cues.
term status: unstable
broader: Facility Accommodation
in scheme: Accommodation

Captioning and Transcripts
type: Concept
definition: Captioning and/or transcripts for audio and video content.
term status: unstable
broader: Resource and Service Accommodation
in scheme: Accommodation

Clear Signage
type: Concept
definition: Clear and simple signage with high contrast and easy-to-read fonts.
term status: unstable
broader: Facility Accommodation
in scheme: Accommodation

Color Blindness
type: Concept
definition: Accessibility feature or accommodation that is designed to address color vision deficiency or color blindness.
description: This service typically involves adjusting the colors used in visual materials, such as websites, videos, or other digital content, to make them more distinguishable.
term status: unstable
broader: Resource and Service Accommodation
in scheme: Accommodation

Communication
type: Concept
definition: Verbal or non-verbal communication assistance.
description: Examples include written communication, picture communication, or communication boards, telephone relay, assistive listening devices, Braille print, audio communication, or other accommodations.
term status: unstable
broader: Resource and Service Accommodation
in scheme: Accommodation

Dietary Accommodation
type: Concept
definition: Alternative meal options to suit dietary needs, restrictions, or preferences.
term status: unstable
broader: Resource and Service Accommodation
in scheme: Accommodation

Facility Accommodation
type: Concept
definition: Features, modifications or adjustments made to a physical space or facility to ensure that individuals with disabilities can access and use the space on an equal basis with others.
description: This can include existing features and modifications to the built environment, such as the installation of ramps, accessible restrooms, or wider doorways, as well as adjustments to lighting, signage, and other environmental factors.
term status: unstable
in scheme: Accommodation
top concept of: Accommodation
narrower: Accessible Housing
narrower: Accessible Parking
narrower: Accessible Restroom
narrower: Adjustable Lighting
narrower: Adjustable Workstations
narrower: Audio Captioning
narrower: Clear Signage
narrower: Hearing Loops
narrower: Physical Accessibility
narrower: Sensory
narrower: Service Animal
narrower: Tactile Signage

Flexible Schedule
type: Concept
definition: Accommodations made for the time frames to complete work or tasks.
description: Examples include adjustments to working hours, extended deadlines, assessment times, or other modifications to schedules.
term status: unstable
broader: Resource and Service Accommodation
in scheme: Accommodation

Hearing Loops
type: Concept
definition: Audio induction loops that transmit signals to hearing aids, cochlear implants or other listening devices.
term status: unstable
broader: Facility Accommodation
in scheme: Accommodation

Multiple Language
type: Concept
definition: Provision of materials or communication in languages other than the primary language used.
term status: unstable
broader: Resource and Service Accommodation
in scheme: Accommodation

Physical Accessibility
type: Concept
definition: Accommodations to ensure entry and mobility throughout a facility.
description: Examples include ramps or lifts for wheelchair accessibility, elevators, automatic doors, and wider doorways to accommodate mobility devices.
term status: unstable
broader: Facility Accommodation
in scheme: Accommodation

Plain Language
type: Concept
definition: Communication that is clear, concise, and easy to understand for all participants.
description: Examples include using everyday language, avoiding technical jargon, and providing relevant context to aid comprehension.
term status: unstable
broader: Resource and Service Accommodation
in scheme: Accommodation

Resource and Service Accommodation
type: Concept
definition: Accommodations that are designed to provide equal access to resources and services and are not related to physical facilities.
term status: unstable
in scheme: Accommodation
top concept of: Accommodation
narrower: Alternative Formats
narrower: Assistive Technology
narrower: Captioning and Transcripts
narrower: Color Blindness
narrower: Communication
narrower: Dietary Accommodation
narrower: Flexible Schedule
narrower: Multiple Language
narrower: Plain Language
narrower: Screen Reader

Screen Reader
type: Concept
definition: Screen reader compatibility for digital materials.
term status: unstable
broader: Resource and Service Accommodation
in scheme: Accommodation

Sensory
type: Concept
definition: Accommodations for hypersensitivity or aversion to certain sounds, lights, textures, or smells.
description: This can include quiet rooms, and reduced lighting.
term status: unstable
broader: Facility Accommodation
in scheme: Accommodation

Service Animal
type: Concept
definition: Service animal accommodations, including clear guidelines, policies, and facilities for allowing service and support animals.
term status: unstable
broader: Facility Accommodation
in scheme: Accommodation

Tactile Signage
type: Concept
definition: Braille signage and tactile cues.
term status: unstable
broader: Facility Accommodation
in scheme: Accommodation

Active Action Status
type: Concept
definition: Action that is ongoing.
description: Examples include: while watching the movie, or driving to a location
term status: stable
in scheme: Action Status
top concept of: Action Status

Completed Action Status
type: Concept
definition: Action that has already taken place.
term status: stable
in scheme: Action Status
top concept of: Action Status

Failed Action Status
type: Concept
definition: Action that failed to complete.
description: The action's error property and the HTTP return code contain more information about the failure.
term status: stable
in scheme: Action Status
top concept of: Action Status

Potential Action Status
type: Concept
definition: Description of an action that is supported.
term status: stable
in scheme: Action Status
top concept of: Action Status

Private For-Profit
type: Concept
definition: Sector that contains privately-owned organizations that operate for profit.
term status: stable
in scheme: Agent Sector
top concept of: Agent Sector

Private Not-For-Profit
type: Concept
definition: Sector that contains privately-owned organizations that operate on a non-profit basis.
description: These include both independent not-for-profit schools and those affiliated with a religious organization.
term status: stable
in scheme: Agent Sector
top concept of: Agent Sector

Public
type: Concept
definition: Sector that contains government and quasi-government organizations.
term status: stable
in scheme: Agent Sector
top concept of: Agent Sector

Articulation Agreement
type: Concept
definition: A formal mechanism establishing course or program equivalencies for recognition and transfer of learning between organizations or programs.
usage note: Applicable only to Transfer Agreements.
term status: unstable
in scheme: Agreement Category
top concept of: Agreement Category

Memorandum of Understanding
type: Concept
definition: A formal mechanism expressing parties’ intent to collaborate or recognize learning, which may precede or accompany specific agreements.
term status: unstable
in scheme: Agreement Category
top concept of: Agreement Category

Multiparty Agreement
type: Concept
definition: An agreement with more than two parties.
term status: unstable
in scheme: Agreement Category
top concept of: Agreement Category

Standing Transfer Arrangement
type: Concept
definition: A formal mechanism applying standardized recognition rules across defined sets of courses or programs.
usage note: Applicable only to Transfer Agreements.
term status: unstable
in scheme: Agreement Category
top concept of: Agreement Category

Broad Match
type: Concept
definition: Assertion indicates that the referenced concept is broader in some way than this concept.
term status: unstable
related match: broadMatch
in scheme: Alignment
top concept of: Alignment

Close Match
type: Concept
definition: Assertion indicates that two concepts are sufficiently similar that they can be used interchangeably.
term status: unstable
related match: closeMatch
in scheme: Alignment
top concept of: Alignment

Exact Match
type: Concept
definition: Indicates semantic similarity denoting an even higher degree of closeness than skos:closeMatch.
term status: unstable
related match: exactMatch
in scheme: Alignment
top concept of: Alignment

Narrow Match
type: Concept
definition: Assertion indicates that the referenced concept is narrower in some way than this concept.
term status: unstable
related match: narrowMatch
in scheme: Alignment
top concept of: Alignment

No Match
type: Concept
definition: Assertion indicating that there is no related concept in the target framework.
term status: unstable
in scheme: Alignment
top concept of: Alignment

Related Match
type: Concept
definition: Assertion indicating an associative, non-hierarchical relationship between the two concepts where neither is broader nor narrower than the other.
term status: unstable
related match: relatedMatch
in scheme: Alignment
top concept of: Alignment

All Of
type: Concept
definition: All of the values.
term status: unstable
in scheme: Array Operation Category
top concept of: Array Operation Category

Any Of
type: Concept
definition: Any (one or more) of the values.
term status: unstable
in scheme: Array Operation Category
top concept of: Array Operation Category

Count Distinct
type: Concept
definition: The number of unique values; yields a number.
term status: unstable
in scheme: Array Operation Category
top concept of: Array Operation Category

Maximum
type: Concept
definition: The highest of all the values.
term status: unstable
in scheme: Array Operation Category
top concept of: Array Operation Category

Mean
type: Concept
definition: The arithmetic mean of all the values.
term status: unstable
in scheme: Array Operation Category
top concept of: Array Operation Category

Minimum
type: Concept
definition: The lowest of all the values.
term status: unstable
in scheme: Array Operation Category
top concept of: Array Operation Category

One Of
type: Concept
definition: Any one (but no more) of the values.
term status: unstable
in scheme: Array Operation Category
top concept of: Array Operation Category

Sum
type: Concept
definition: The numeric total obtained by adding all the values.
term status: unstable
in scheme: Array Operation Category
top concept of: Array Operation Category

Artifact
type: Concept
definition: Work or product created or produced by the person being assessed.
description: Artifact includes, but is not limited to, an academic paper, video documentary, computer software, music composition, choreography, novel, short story, journal article, news article, report, lesson plan, product design, portfolio, manufactured product, etc. Methods of evaluation may include multiple evaluators either individually or as an expert panel using general criteria or more structured rubrics whose scores are combined, etc. Criteria and methods of evaluation are often very similar to those for assessing a performance, without the facets specific to a live performance
term status: stable
in scheme: Assessment Method
top concept of: Assessment Method
narrower: Portfolio Evaluation

Exam
type: Concept
definition: Mix of scored items presented in fixed or open response formats including qualifying and comprehensive exams.
description: Exam includes, but is not limited to, multiple choice, true-false, written essay, short-answer, fill-in or oral response formats that could include measurements of reasoning, problem-solving, critical thinking.
term status: stable
in scheme: Assessment Method
top concept of: Assessment Method

Performance
type: Concept
definition: Set of behaviors or actions assessed as demonstration of competencies where the assessment occurs either as the actions take place (i.e., live) or through review of recordings of those actions in a persistent media (e.g., video, audio, keystroke records, etc.)
description: Performance includes, but is not limited to, dance, music, teaching, acting, medical procedures, truck driving, manufacturing production, etc. Criteria include the categories and benchmarks on which the performance is assessed. Methods of evaluation can include multiple evaluators either individually or as an expert panel using general criteria or more structured rubrics whose scores are combined (e.g., assessing a dance performance, evaluating the performance of a medical procedure, truck driving procedure, manufacturing process such as machining).
term status: stable
in scheme: Assessment Method
top concept of: Assessment Method

Portfolio Evaluation
type: Concept
definition: Assessment method that evaluates a learner’s portfolio of evidence to determine knowledge, skills, or competencies.
term status: unstable
broader: Artifact
in scheme: Assessment Method

Formative Assessment
type: Concept
definition: Formal and informal assessment procedures conducted during the learning process to support intentional modification in teaching and learning activities in order to improve learner attainment.
term status: stable
in scheme: Assessment Use
top concept of: Assessment Use

Summative Assessment
type: Concept
definition: Assessment of learning at the end of an instructional unit to determine whether some established standard or benchmark has been achieved.
term status: stable
in scheme: Assessment Use
top concept of: Assessment Use

Citizen
type: Concept
definition: Person who is a legally recognized subject of a particular nation, state, province, or commonwealth.
term status: stable
in scheme: Audience
top concept of: Audience

Cultural/Ethnic Minority
type: Concept
definition: Person who belongs to a cultural and/or ethnic minority group, relative to the surrounding population.
term status: unstable
in scheme: Audience
top concept of: Audience

Currently Incarcerated
type: Concept
definition: Person who is currently incarcerated.
term status: unstable
in scheme: Audience
top concept of: Audience

Current Military
type: Concept
definition: Current member of a nation's military.
term status: stable
in scheme: Audience
top concept of: Audience

Current Military Dependent
type: Concept
definition: Dependent (usually a child) of a current member of a nation's military.
term status: stable
in scheme: Audience
top concept of: Audience

Current Military Spouse
type: Concept
definition: Spouse of a current member of a nation's military.
term status: stable
in scheme: Audience
top concept of: Audience

Current Student
type: Concept
definition: Student currently participating in a learning opportunity.
term status: stable
in scheme: Audience
top concept of: Audience

Displaced
type: Concept
definition: Person who has been displaced from their home or community.
term status: unstable
in scheme: Audience
top concept of: Audience

Formerly Incarcerated
type: Concept
definition: Person who was formerly incarcerated.
term status: unstable
in scheme: Audience
top concept of: Audience

Former Member
type: Concept
definition: Former member of an organization, society, or recognized group.
description: Membership includes types of affiliation such as employment or other work relationships, enrollment at an educational institution etc.
term status: unstable
in scheme: Audience
top concept of: Audience

Former Military / Veteran
type: Concept
definition: Veteran of military service.
term status: stable
in scheme: Audience
top concept of: Audience

Former Military Dependent
type: Concept
definition: Former dependent (usually a child) of a veteran of a nation's military.
term status: stable
in scheme: Audience
top concept of: Audience

Former Military Spouse
type: Concept
definition: Spouse of a veteran of a nation's military.
term status: stable
in scheme: Audience
top concept of: Audience

Former Student / Alumni
type: Concept
definition: Student who previously participated in a learning opportunity.
term status: stable
in scheme: Audience
top concept of: Audience

Full-Time
type: Concept
definition: Participation in a learning opportunity to an extent that meets the opportunity's requirements for full-time status.
term status: stable
in scheme: Audience
top concept of: Audience

Future Member
type: Concept
definition: Future member of an organization, society, or recognized group.
description: Membership includes types of affiliation such as employment or other work relationships, enrollment at an educational institution etc.
term status: unstable
in scheme: Audience
top concept of: Audience

Future Student
type: Concept
definition: Student who intends to participate in a learning opportunity.
term status: unstable
in scheme: Audience
top concept of: Audience

Homemaker
type: Concept
definition: Person who provides unpaid services to family members in the home.
term status: unstable
in scheme: Audience
top concept of: Audience

Job Seeker
type: Concept
definition: Person who is currently seeking work.
description: This includes new job seekers as well as those who already have work and are seeking other work.
term status: unstable
in scheme: Audience
top concept of: Audience

Member
type: Concept
definition: Current member of an organization, society, or recognized group.
description: Membership includes types of affiliation such as employment or other work relationships, enrollment at an educational institution etc.
term status: stable
in scheme: Audience
top concept of: Audience

Non-Citizen
type: Concept
definition: Person who is not a legally recognized subject of a particular nation, state, province, or commonwealth.
term status: stable
in scheme: Audience
top concept of: Audience

Non-Member
type: Concept
definition: Individual without membership status or privileges conferred by an organization, society, or recognized group.
term status: stable
in scheme: Audience
top concept of: Audience

Non-Resident
type: Concept
definition: Person whose primary residence is not in nation, state, province, or commonwealth of concern.
term status: stable
in scheme: Audience
top concept of: Audience

Part-Time
type: Concept
definition: Participation in a learning opportunity to an extent that meets the opportunity's requirements for part-time status.
term status: stable
in scheme: Audience
top concept of: Audience

Private Employee
type: Concept
definition: Person employed in the private sector.
term status: stable
in scheme: Audience
top concept of: Audience

Public Employee
type: Concept
definition: Person employed in the public sector.
term status: stable
in scheme: Audience
top concept of: Audience

Resident
type: Concept
definition: Person whose permanent and principal home is in a particular nation, state, province, or commonwealth.
term status: stable
in scheme: Audience
top concept of: Audience

Unemployed
type: Concept
definition: Person who is not employed.
term status: unstable
in scheme: Audience
top concept of: Audience

Youth
type: Concept
definition: Person roughly between the ages of 15 and 24.
term status: unstable
in scheme: Audience
top concept of: Audience

Advanced Level
type: Concept
definition: Intended for those with significant experience or expertise where developmental expectations are staged for assessing knowledge, skills, or competencies beyond the novice and intermediate levels.
term status: stable
in scheme: Audience Level
top concept of: Audience Level

Associates Degree Level
type: Concept
definition: Intended for those completing college/university-level programs within their first one to two years (lower-division) of post-secondary education.
term status: stable
broader: Post-Secondary Level
in scheme: Audience Level

Bachelors Degree Level
type: Concept
definition: Intended for those completing college/university-level programs within approximately three to four years where course work and activities advance skills from a lower-division or generalist level to an upper-division level.
term status: stable
broader: Post-Secondary Level
in scheme: Audience Level

Beginner Level
type: Concept
definition: Intended for novices or those with limited experience.
term status: stable
in scheme: Audience Level
top concept of: Audience Level

Doctoral Degree Level
type: Concept
definition: Intended for those who have completed Bachelors and Masters degrees or their equivalent and who will be required to complete either independent research or a significant project or paper.
term status: stable
broader: Post-Secondary Level
in scheme: Audience Level

Graduate Level
type: Concept
definition: Intended for those who enrolled in a degree program or other formal program above the baccalaureate level, such as a masters or doctoral degree program.
term status: stable
in scheme: Audience Level
top concept of: Audience Level

Intermediate Level
type: Concept
definition: Intended for those with some experience, where knowledge, skills, and competency expectations are staged for development beyond novice-level and in preparation for a more advanced-level.
description: An individual at this level has foundational competencies to function independently with occasional supervision.
term status: stable
in scheme: Audience Level
top concept of: Audience Level

Lower Division Level
type: Concept
definition: Intended for those in the first half of an undergraduate level program.
term status: stable
in scheme: Audience Level
top concept of: Audience Level

Masters Degree Level
type: Concept
definition: Intended for those who have completed a Bachelor's Degree or equivalent.
term status: stable
broader: Post-Secondary Level
in scheme: Audience Level

Post-Secondary Level
type: Concept
definition: Intended for those who have completed secondary level school programs or equivalent.
term status: stable
in scheme: Audience Level
top concept of: Audience Level
narrower: Associates Degree Level
narrower: Bachelors Degree Level
narrower: Doctoral Degree Level
narrower: Masters Degree Level

Professional Level
type: Concept
definition: Intended for those attending professional programs or equivalent, such as law or medicine.
description: Other levels can typically be paired with Professional Level to refine a description of a level.
term status: stable
in scheme: Audience Level
top concept of: Audience Level

Remedial Level
type: Concept
definition: Intended for those who are under-prepared for learning at a particular level.
term status: unstable
in scheme: Audience Level
top concept of: Audience Level

Secondary School or Equivalent
type: Concept
definition: Intended for those attending secondary (high-school) level programs.
term status: stable
in scheme: Audience Level
top concept of: Audience Level

Undergraduate Level
type: Concept
definition: Intended for those who are enrolled in a degree program or other formal program at or below the baccalaureate, such as an associate’s degree, vocational, or technical program.
term status: stable
in scheme: Audience Level
top concept of: Audience Level

Upper Division Level
type: Concept
definition: Intended for those in the second half of an undergraduate level program.
term status: stable
in scheme: Audience Level
top concept of: Audience Level

Badge Claim
type: Concept
definition: Verifiable visual representation that can be shared, embedded, linked, or otherwise used to publicly indicate that an individual has the represented credential.
term status: stable
in scheme: Claim Type
top concept of: Claim Type

Quality Assurance Claim
type: Concept
definition: Verifiable representation of quality assurance.
term status: stable
in scheme: Claim Type
top concept of: Claim Type

Transcript Claim
type: Concept
definition: Verifiable representation of postsecondary courses and degrees completed.
term status: stable
in scheme: Claim Type
top concept of: Claim Type

Verified Claim
type: Concept
definition: Verifiable representation of the credential holder's achievement.
term status: stable
in scheme: Claim Type
top concept of: Claim Type

Eligible Training Providers List
type: Concept
definition: Training providers meeting the requirements stipulated in the U.S. Workforce Innovation and Opportunity Act per the promulgating body.
description: This list includes the Learning Opportunities and Credentials offered by training providers that have met requirements.
term status: unstable
in scheme: Collection Category
top concept of: Collection Category

GI Bill
type: Concept
definition: Education and training programs qualifying for the U.S. GI Bill per the promulgating body.
term status: unstable
in scheme: Collection Category
top concept of: Collection Category

Industry Recognized
type: Concept
definition: Learning Opportunities, Learning Programs, Courses, Assessments or Credentials recognized in one or more industries based on factors such as job market demand per the promulgating body.
term status: unstable
in scheme: Collection Category
top concept of: Collection Category

Perkins
type: Concept
definition: Credentials approved for funding under the U.S. Strengthening Career and Technical Education for the 21st Century Act (Perkins V) per the promulgating body.
term status: unstable
in scheme: Collection Category
top concept of: Collection Category

Promise Scholarship
type: Concept
definition: Specified programs in eligible postsecondary educational institutions for which qualified students may receive a Promise Scholarship.
term status: unstable
in scheme: Collection Category
top concept of: Collection Category

Quality
type: Concept
definition: Learning Opportunities, Learning Programs, Courses, Assessments or Credentials that meet criteria for quality as determined by the promulgating body.
term status: unstable
in scheme: Collection Category
top concept of: Collection Category

State Approved Postsecondary Programs
type: Concept
definition: Learning Opportunities, Learning Programs, Courses, Assessments or Credentials approved by a state agency to be offered within that state’s jurisdiction by postsecondary institutions.
term status: unstable
in scheme: Collection Category
top concept of: Collection Category

Equal To
type: Concept
definition: The value of the left is equal to the value of the right.
term status: unstable
equivalent class: eq
in scheme: Comparator Category
top concept of: Comparator Category

Greater Than
type: Concept
definition: The value of the left is greater than the value of the right.
term status: unstable
equivalent class: gt
in scheme: Comparator Category
top concept of: Comparator Category

Greater Than or Equal To
type: Concept
definition: The value of the left is greater than or equal to the value of the right.
term status: unstable
equivalent class: gteq
in scheme: Comparator Category
top concept of: Comparator Category

Less Than
type: Concept
definition: The value of the left is less than the value of the right.
term status: unstable
equivalent class: lt
in scheme: Comparator Category
top concept of: Comparator Category

Less Than or Equal To
type: Concept
definition: The value of the left is less than or equal to the value of the right.
term status: unstable
equivalent class: lteq
in scheme: Comparator Category
top concept of: Comparator Category

Not Equal To
type: Concept
definition: The value of the left is not equal to the value of the right.
term status: unstable
equivalent class: neq
in scheme: Comparator Category
top concept of: Comparator Category

Aggregate Cost
type: Concept
definition: Sum of direct costs.
term status: stable
in scheme: Cost Type
top concept of: Cost Type

Application
type: Concept
definition: Cost of applying for the resource being described.
term status: stable
in scheme: Cost Type
top concept of: Cost Type

Background Check
type: Concept
definition: Cost for a background check.
term status: stable
in scheme: Cost Type
top concept of: Cost Type

Enrollment Fee
type: Concept
definition: Cost to enroll in the learning opportunity being described.
term status: stable
in scheme: Cost Type
top concept of: Cost Type

Graduation Fee
type: Concept
definition: Separate graduation fee.
term status: stable
in scheme: Cost Type
top concept of: Cost Type

Learning Resource
type: Concept
definition: Cost for one or more learning resources.
description: Examples include resources such as textbooks, workbooks, laboratory supplies, and other related supplies.
term status: stable
in scheme: Cost Type
top concept of: Cost Type

Meals
type: Concept
definition: Cost for meals while participating in the learning opportunity.
term status: stable
in scheme: Cost Type
top concept of: Cost Type

Mixed Fees
type: Concept
definition: The sum of fees that are not identified individually.
term status: stable
in scheme: Cost Type
top concept of: Cost Type

Optional Charges
type: Concept
definition: Cost for additional fees, other services, equipment, or facilities that are not required.
term status: stable
in scheme: Cost Type
top concept of: Cost Type

Processing Fee
type: Concept
definition: Cost for processing or expediting information related to the resource being described.
term status: stable
in scheme: Cost Type
top concept of: Cost Type

Program Specific Fee
type: Concept
definition: Additional cost for participation with a specific program or course of study such as engineering, business, and nursing.
term status: stable
in scheme: Cost Type
top concept of: Cost Type

Reexamination Fee
type: Concept
definition: Cost for retaking an instance of the resource being described.
term status: stable
in scheme: Cost Type
top concept of: Cost Type

Maintenance Fee
type: Concept
definition: Cost for maintenance or renewal of the resource being described.
term status: stable
in scheme: Cost Type
top concept of: Cost Type

Rescheduling Fee
type: Concept
definition: Cost for rescheduling an instance of the resource being described.
term status: stable
in scheme: Cost Type
top concept of: Cost Type

Room or Residence
type: Concept
definition: Cost for room, residence or boarding.
term status: stable
in scheme: Cost Type
top concept of: Cost Type

Scoring Fee
type: Concept
definition: Cost for scoring the resource being described.
term status: stable
in scheme: Cost Type
top concept of: Cost Type

Standalone/Extra Assessment
type: Concept
definition: Cost for standalone assessments.
term status: stable
in scheme: Cost Type
top concept of: Cost Type

Student Services Fee
type: Concept
definition: Cost for student services related to the learning opportunity.
term status: stable
in scheme: Cost Type
top concept of: Cost Type

Technology Fee
type: Concept
definition: Cost for accessing technologies related to the learning opportunity or activity.
term status: stable
in scheme: Cost Type
top concept of: Cost Type

Tuition
type: Concept
definition: Cost for teaching and instruction.
term status: stable
in scheme: Cost Type
top concept of: Cost Type

Active
type: Concept
definition: Awards of the credential are ongoing.
term status: stable
in scheme: Credential Status
top concept of: Credential Status

Ceasing
type: Concept
definition: Resource is in the process of becoming no longer active, current, ongoing, offered, operational, or available.
term status: unstable
in scheme: Credential Status
top concept of: Credential Status

Deprecated
type: Concept
definition: Awards of the credential have ceased.
term status: stable
in scheme: Credential Status
top concept of: Credential Status

Probationary
type: Concept
definition: Credential award is provisional or temporary; frequently pending further assessment of qualification.
term status: stable
in scheme: Credential Status
top concept of: Credential Status

Suspended
type: Concept
definition: Awards of the credential are not available, but may resume.
term status: stable
in scheme: Credential Status
top concept of: Credential Status

Teach Out
type: Concept
definition: Arrangement by which an educational institution provides its current students with the opportunity to complete the credential when the program, institution or location offering access closes.
term status: unstable
in scheme: Credential Status
top concept of: Credential Status

Academic Year
type: Concept
definition: Credit that is issued or accepted as being related to one or more academic years.
term status: stable
broader: Time-Based Credit
in scheme: Credit Unit

Carnegie Unit
type: Concept
definition: Credit that is based on 120 hours of contact time or class time with an instructor.
term status: stable
broader: Time-Based Credit
in scheme: Credit Unit

Certificate Credit
type: Concept
definition: Credit that is issued or accepted for certificates.
description: Includes credits earned while enrolled in a certificate program.
term status: stable
broader: Type-Based Credit
in scheme: Credit Unit

Clock Hour
type: Concept
definition: Credit that is issued or accepted as being related to one or more temporal hours.
term status: stable
broader: Time-Based Credit
in scheme: Credit Unit

Competency Credit
type: Concept
definition: Credit that is issued or accepted for a particular competency or set of competencies.
term status: stable
broader: Type-Based Credit
in scheme: Credit Unit

Contact Hour
type: Concept
definition: Credit that is issued or accepted as being related to one or more temporal hours of instruction presented to students.
term status: stable
broader: Time-Based Credit
in scheme: Credit Unit

Continuing Education Unit
type: Concept
definition: Credit that is issued or is accepted as education units for meeting professional development requirements.
description: Based on international standards, continuing education units are based on contact hours that may be converted to other units of measurement, such as professional development hours (PDH), continuing education credits (CEU), and continuing professional credits (CPC).
term status: stable
broader: Type-Based Credit
in scheme: Credit Unit

Degree Credit
type: Concept
definition: Credit that is issued or is accepted as credit for earning a college-level degree.
description: Includes credits earned while enrolled in a postsecondary program for a college-level degree.
term status: stable
broader: Type-Based Credit
in scheme: Credit Unit

Dual Credit
type: Concept
definition: Credit that is applicable to two different educational levels.
term status: stable
broader: Type-Based Credit
in scheme: Credit Unit

Quarter Hour
type: Concept
definition: Credit that is issued or accepted at an academic quarter level.
term status: stable
broader: Time-Based Credit
in scheme: Credit Unit

Requirement Credit
type: Concept
definition: Credit that is issued or accepted for some type of requirement.
term status: stable
broader: Type-Based Credit
in scheme: Credit Unit

Secondary Diploma Credit
type: Concept
definition: Credit that is issued or accepted for a secondary diploma.
description: Includes credits earned while enrolled in a secondary diploma program that meet graduation requirements.
term status: stable
broader: Type-Based Credit
in scheme: Credit Unit

Semester Hour
type: Concept
definition: Credit that is issued or accepted at a semester level.
term status: stable
broader: Time-Based Credit
in scheme: Credit Unit

Time-Based Credit
type: Concept
definition: Credit with a unit of measurement based on time, either figuratively or literally.
term status: stable
in scheme: Credit Unit
top concept of: Credit Unit
narrower: Academic Year
narrower: Carnegie Unit
narrower: Clock Hour
narrower: Contact Hour
narrower: Quarter Hour
narrower: Semester Hour

Type-Based Credit
type: Concept
definition: Credit with a unit of measurement based on the type of credit.
term status: stable
in scheme: Credit Unit
top concept of: Credit Unit
narrower: Certificate Credit
narrower: Competency Credit
narrower: Continuing Education Unit
narrower: Degree Credit
narrower: Dual Credit
narrower: Requirement Credit
narrower: Secondary Diploma Credit

Blended Delivery
type: Concept
definition: Delivery includes significant levels of both in person and online.
term status: stable
in scheme: Delivery Type
top concept of: Delivery Type

In-Person Only
type: Concept
definition: Delivery is only face-to-face.
term status: stable
in scheme: Delivery Type
top concept of: Delivery Type

Online Only
type: Concept
definition: Delivery is only via the Internet.
term status: stable
in scheme: Delivery Type
top concept of: Delivery Type

Variable Site
type: Concept
definition: Delivery is not tied to a specific site.
description: Includes physical/in-person delivery to a range of locations, whether predetermined or customized to a specific need. Examples include equipment for dispensing information to mobile devices in locations with limited/no connection.
term status: unstable
in scheme: Delivery Type
top concept of: Delivery Type

Academic Assistantship
type: Concept
definition: Paid employment in which students receive tuition or other reimbursement for the tasks they perform for faculty members, departments, and/or educational institutions.
term status: stable
broader: Work-Based
equivalent class: Assistantships
in scheme: Financial Assistance

Apprenticeship
type: Concept
definition: Combination of on-the-job training and related instruction that meets standards in which workers learn the practical and theoretical aspects of a skilled occupation.
term status: stable
broader: Work-Based
in scheme: Financial Assistance

Co-Operative
type: Concept
definition: Paid work experience utilized by approved career and technical education programs to combine classroom and on-the-job training and education which provides academic credit for structured job experience.
term status: stable
broader: Work-Based
in scheme: Financial Assistance

Department of Defense Tuition Assistance
type: Concept
definition: Financial assistance provided to qualified active duty service members and their families for voluntary off-duty educational programs in support of professional and personal self-development goals.
term status: stable
broader: Military
equivalent class: DODTuitionAssistance
in scheme: Financial Assistance

Federal Grant
type: Concept
definition: Financial subsidy, which doesn’t require repayment, based on meeting requirements determined by the Federal Government.
term status: stable
broader: Grant
equivalent class: OtherFederalGrants
in scheme: Financial Assistance

Federal Scholarship
type: Concept
definition: Financial aid award, which doesn’t require repayment, from the Federal Government based on student achievement and other criteria for education.
term status: stable
broader: Scholarship
equivalent class: FederalScholarships
in scheme: Financial Assistance

Federal Subsidized Loan
type: Concept
definition: Loan from the Federal Government that is based on financial needs of the student and is intended to offset costs related to education, living, and resources.
term status: stable
broader: Loan
equivalent class: FederalSubsidizedLoans
in scheme: Financial Assistance

Federal Unsubsidized Loan
type: Concept
definition: Loan from the Federal Government that does not require evidence of the financial needs of the student, and is intended to offset costs related to education, living, and resources.
term status: stable
broader: Loan
equivalent class: FederalUnsubsidizedLoans
in scheme: Financial Assistance

Federal Work Study
type: Concept
definition: Program funded by the Federal Government designed to provide part-time jobs for students to offset educational expenses.
term status: stable
broader: Work-Based
equivalent class: FederalWorkStudy
in scheme: Financial Assistance

General Financial Assistance
type: Concept
definition: Types of financial assistance for students towards education, training, or related costs of pursuing a credential, program, or other resource.
term status: stable
equivalent class: https://ceds.ed.gov/element/000113
in scheme: Financial Assistance
top concept of: Financial Assistance
narrower: Grant
narrower: Loan
narrower: Scholarship
narrower: Work-Based

Grant
type: Concept
definition: Financial subsidy, which doesn’t require repayment, based on meeting requirements determined by the grantor.
term status: stable
broader: General Financial Assistance
in scheme: Financial Assistance
narrower: Federal Grant
narrower: Institutional Grant
narrower: Loan Forgiveness Program
narrower: Other Grant
narrower: Pell Grant
narrower: Private Grant
narrower: Promise Program
narrower: State or Local Grant
narrower: Stipend
narrower: Workforce Innovation and Opportunity Act (WIOA)

Institutional Grant
type: Concept
definition: Financial subsidy, including free or discounted tuition or other fees, which doesn’t require repayment, based on meeting requirements determined by an educational institution.
term status: stable
broader: Grant
equivalent class: InstitutionalGrants
in scheme: Financial Assistance

Institutional Loan
type: Concept
definition: Loan from an educational institution that is intended to offset costs related to education, living, and resources.
term status: stable
broader: Loan
equivalent class: InstitutionalLoans
in scheme: Financial Assistance

Institutional Scholarship
type: Concept
definition: Financial aid award, which doesn’t require repayment, from an educational institution based on student achievement and other criteria for education.
term status: stable
broader: Scholarship
equivalent class: InstitutionalScholarships
in scheme: Financial Assistance

Internship
type: Concept
definition: Time-limited work offered by an organization approved by a qualified institution to gain experience or satisfy requirements for another resource.
term status: stable
broader: Work-Based
in scheme: Financial Assistance

Loan
type: Concept
definition: Financial aid that requires repayment with terms determined by the entity providing the loan.
term status: stable
broader: General Financial Assistance
in scheme: Financial Assistance
narrower: Federal Subsidized Loan
narrower: Federal Unsubsidized Loan
narrower: Institutional Loan
narrower: Other Loan
narrower: Parent PLUS Loan
narrower: Private Loan
narrower: State or Local Loan

Loan Forgiveness Program
type: Concept
definition: Program that forgives the remaining balance on a loan after meeting certain requirements.
term status: stable
broader: Grant
in scheme: Financial Assistance

Military
type: Concept
definition: Financial aid available to active duty service members, veterans, and/or their qualified family members.
term status: stable
equivalent class: https://ceds.ed.gov/element/001610
in scheme: Financial Assistance
top concept of: Financial Assistance
narrower: Department of Defense Tuition Assistance
narrower: Post 9-11 GI Bill
narrower: State or Local Military Assistance
narrower: Veteran Educational Assistance Program
narrower: Vocational Rehabilitation

Other Grant
type: Concept
definition: Financial subsidy based on meeting requirements from one or more other sources.
term status: stable
broader: Grant
equivalent class: OtherGrants
in scheme: Financial Assistance

Other Loan
type: Concept
definition: Loan from one or more other sources that is intended to offset costs related to education, living, and resources.
term status: stable
broader: Loan
equivalent class: OtherLoans
in scheme: Financial Assistance

Other On-Campus Work
type: Concept
definition: Paid non-academic employment available for students on an educational institution’s campus.
term status: stable
broader: Work-Based
equivalent class: OtherOnCampusWork
in scheme: Financial Assistance

Other Scholarship
type: Concept
definition: Financial aid award, which doesn’t require repayment, from one or more other sources based on student achievement and other criteria.
term status: stable
broader: Scholarship
equivalent class: OtherScholarships
in scheme: Financial Assistance

Parent PLUS Loan
type: Concept
definition: Loan from the Federal Government available to the parents of dependent students.
term status: stable
broader: Loan
equivalent class: ParentPLUSLoans
in scheme: Financial Assistance

Pell Grant
type: Concept
definition: Financial subsidy, which doesn’t require repayment, that the Federal Government provides based on the financial needs of the student.
term status: stable
broader: Grant
equivalent class: PellGrants
in scheme: Financial Assistance

Post 9-11 GI Bill
type: Concept
definition: Financial assistance provided to qualified active duty service members, veterans, and qualified family members that is based on military service and intended to offset costs related to education, living, and resources.
term status: stable
broader: Military
equivalent class: Post911GIBill
in scheme: Financial Assistance

Private Grant
type: Concept
definition: Financial subsidy, which doesn’t require repayment, based on meeting requirements determined by a private entity, including employers.
term status: stable
broader: Grant
equivalent class: PrivateGrants
in scheme: Financial Assistance

Private Loan
type: Concept
definition: Loan from a private entity, including employers, that is intended to offset costs related to education, living, and resources.
term status: stable
broader: Loan
equivalent class: PrivateLoans
in scheme: Financial Assistance

Private Scholarship
type: Concept
definition: Financial aid award, which doesn’t require repayment, from a private entity, including employers, based on student achievement and other criteria for education.
term status: stable
broader: Scholarship
equivalent class: PrivateScholarships
in scheme: Financial Assistance

Promise Program
type: Concept
definition: Program for students in a given area, with minimal requirements, that pays for tuition without requiring repayment.
term status: stable
broader: Grant
in scheme: Financial Assistance

Scholarship
type: Concept
definition: Financial aid award based on student achievement and other criteria for education that doesn’t require repayment.
term status: stable
broader: General Financial Assistance
in scheme: Financial Assistance
narrower: Federal Scholarship
narrower: Institutional Scholarship
narrower: Other Scholarship
narrower: Private Scholarship
narrower: State or Local Scholarship

State or Local Grant
type: Concept
definition: Financial subsidy, which doesn’t require repayment, based on meeting requirements determined by a state, province, region, and/or local government.
term status: stable
broader: Grant
equivalent class: StateAndLocalGrants
in scheme: Financial Assistance

State or Local Loan
type: Concept
definition: Loan from a state, province, region, and/or local government that is intended to offset costs related to education, living, and resources.
term status: stable
broader: Loan
equivalent class: StateLoans
in scheme: Financial Assistance

State or Local Military Assistance
type: Concept
definition: Financial aid provided by a state or local government to active duty service members, veterans, and/or qualified family members.
term status: stable
broader: Military
in scheme: Financial Assistance

State or Local Scholarship
type: Concept
definition: Financial aid award, which doesn’t require repayment, from a state, province, region, and/or local government based on student achievement and other criteria for education.
term status: stable
broader: Scholarship
equivalent class: StateAndLocalScholarships
in scheme: Financial Assistance

State or Local Work
type: Concept
definition: Program funded by a state, province, region, and/or local government designed to provide work for students to offset educational expenses.
term status: stable
broader: Work-Based
equivalent class: StateWork
in scheme: Financial Assistance

Stipend
type: Concept
definition: A fixed sum of money paid for services or to defray expenses incurred through specific activities, which is typically distinct from wages or a salary.
term status: unstable
broader: Grant
in scheme: Financial Assistance

Veteran Educational Assistance Program
type: Concept
definition: Financial assistance provided to qualified active duty service members and veterans as a matching program that is intended to offset educational expenses.
term status: stable
broader: Military
in scheme: Financial Assistance

Vocational Rehabilitation
type: Concept
definition: Financial for veterans with a qualifying service-connected disability rating for training or education related to pursuit of a career or career-related resource.
term status: stable
broader: Military
in scheme: Financial Assistance

Workforce Innovation and Opportunity Act (WIOA)
type: Concept
definition: Financial aid established on behalf of a qualified participant with a training provider that is on the state's Eligible Training Provider List (ETPL).
term status: stable
broader: Grant
in scheme: Financial Assistance

Work-Based
type: Concept
definition: Financial compensation for participating in work-based learning opportunities.
term status: stable
broader: General Financial Assistance
in scheme: Financial Assistance
narrower: Academic Assistantship
narrower: Apprenticeship
narrower: Co-Operative
narrower: Federal Work Study
narrower: Internship
narrower: Other On-Campus Work
narrower: State or Local Work

Professional Associations
type: Concept
definition: External stakeholder review, guidance or recommendations by professional associations.
term status: stable
in scheme: External Input
top concept of: External Input

Business
type: Concept
definition: External stakeholder review, guidance or recommendations by business.
term status: stable
in scheme: External Input
top concept of: External Input

Business or Industry Association
type: Concept
definition: External stakeholder review, guidance or recommendations by business or industry association.
term status: stable
in scheme: External Input
top concept of: External Input

Consumers
type: Concept
definition: External stakeholder review, guidance or recommendations by consumers.
term status: stable
in scheme: External Input
top concept of: External Input

Education Administrators
type: Concept
definition: External stakeholder review, guidance or recommendations by education administrators.
term status: stable
in scheme: External Input
top concept of: External Input

Educators
type: Concept
definition: External stakeholder review, guidance or recommendations by education instructors or faculty.
term status: stable
in scheme: External Input
top concept of: External Input

Subject Matter Experts
type: Concept
definition: External stakeholder review, guidance or recommendations by subject matter experts.
term status: stable
in scheme: External Input
top concept of: External Input

Governments
type: Concept
definition: External stakeholder review, guidance or recommendations by government.
description: May include local, state or provincial, and federal or national government.
term status: stable
in scheme: External Input
top concept of: External Input

Guardians
type: Concept
definition: External stakeholder review, guidance or recommendations by parents or guardians.
term status: stable
in scheme: External Input
top concept of: External Input

International Bodies
type: Concept
definition: External stakeholder review, guidance or recommendations by international bodies.
term status: stable
in scheme: External Input
top concept of: External Input

Practitioners
type: Concept
definition: External stakeholder review, guidance or recommendations by practitioners.
term status: stable
in scheme: External Input
top concept of: External Input

Public
type: Concept
definition: External stakeholder review, guidance or recommendations by community members and the general public.
term status: stable
in scheme: External Input
top concept of: External Input

Students
type: Concept
definition: External stakeholder review, guidance or recommendations by all types of learners.
term status: stable
in scheme: External Input
top concept of: External Input

Applied Instruction
type: Concept
definition: Provides learning opportunities in the context of real world examples, cases, and applications.
description: Applies to methods such as contextual learning, applied academics, academic-technical integration, problem-based learning, project-based learning, and case methods.
term status: stable
in scheme: Learning Method
top concept of: Learning Method

Apprenticeship
type: Concept
definition: Learning through work that leads to a credential that is recognized by a relevant authority and is deliberately structured and supported to provide a progression of learning experiences.
term status: unstable
broader: Work Based
in scheme: Learning Method

Augmented Reality
type: Concept
definition: Provides interactive learning experience through technology that superimposes a computer-generated image on a user's view of the real world, thus providing a composite view.
term status: unstable
in scheme: Learning Method
top concept of: Learning Method

Clinical Rotation
type: Concept
definition: Learning through real-world work experience in a medical context under the direct supervision of a qualified practitioner.
term status: unstable
broader: Work Based
in scheme: Learning Method

Cohort-Based
type: Concept
definition: Format in which people progress as a group.
term status: unstable
in scheme: Learning Method
top concept of: Learning Method

Gaming
type: Concept
definition: Provides interactive educational experiences which demonstrate concepts in a way that promotes critical thinking, overcoming challenges within prescribed rule sets, problem solving, and in some cases, teamwork and/or competition.
description: Individual or group games that have cognitive, social, behavioral, and/or emotional dimensions which are related to educational objectives.
term status: stable
in scheme: Learning Method
top concept of: Learning Method

Internship
type: Concept
definition: Work position that is intended to provide a learner with an opportunity to gain experience but that is not structured around learning and does not itself lead to a credential recognized by a relevant authority.
term status: unstable
broader: Work Based
in scheme: Learning Method

Laboratory
type: Concept
definition: Hands-on individual or group experiences for applied learning concepts and methods, procedures and protocols with equipment and technologies.
description: Applies to clinical practice and methods such as physical and/or virtual simulation or participation, whether direct or indirect.
term status: stable
in scheme: Learning Method
top concept of: Learning Method

Lecture
type: Concept
definition: Primary method is presentation by an instructor of learning material and may include student discussion.
description: Lecture courses may involve student questions and answers, but the role of the instructor is clearly differentiated from that of the students.
term status: stable
in scheme: Learning Method
top concept of: Learning Method

Medical Residency
type: Concept
definition: Learning through real-world work experience at the graduate level in a medical context where a qualified participant works under the direct supervision of a senior practicioner.
term status: unstable
broader: Work Based
in scheme: Learning Method

Prerecorded
type: Concept
definition: Learning by using video, audio, or other prerecorded content.
term status: stable
in scheme: Learning Method
top concept of: Learning Method

Self Paced
type: Concept
definition: Provides for personalization and flexibility in the timing and progression of learning for individual learners based on their preferences and needs, prior learning experiences, and ability to progress through learning opportunities.
description: Applies to methods such as competency-based education, open-entry/open exit, independent study, private study, and correspondence.
term status: stable
in scheme: Learning Method
top concept of: Learning Method

Seminar
type: Concept
definition: Primary method is active student discussion leading to advancement of the topic and facilitated by an instructor.
description: Seminars typically involve small groups to facilitate equal opportunity with the instructor and colleagues to be engaged and occasionally may include students leading discussions.
term status: stable
in scheme: Learning Method
top concept of: Learning Method

Simulation
type: Concept
definition: Provides interactive learning experience through imitation of a situation or process.
term status: unstable
in scheme: Learning Method
top concept of: Learning Method

Work Based
type: Concept
definition: Provides real-world work experiences that may be paid or unpaid and provided in group or individual formats normally outside the classroom.
description: Applies to methods such as apprenticeships, internships, externships, work study, clinical rotations, residencies, practicums, field study, team projects, and cooperative education.
term status: stable
in scheme: Learning Method
top concept of: Learning Method
narrower: Apprenticeship
narrower: Clinical Rotation
narrower: Internship
narrower: Medical Residency

Active
type: Concept
definition: Resource is active, current, ongoing, offered, operational, or available.
term status: unstable
in scheme: Life Cycle Status
top concept of: Life Cycle Status

Ceased
type: Concept
definition: Resource is permanently no longer active, current, ongoing, offered, operational, or available.
term status: unstable
in scheme: Life Cycle Status
top concept of: Life Cycle Status

Ceasing
type: Concept
definition: Resource is in the process of becoming no longer active, current, ongoing, offered, operational, or available.
term status: unstable
in scheme: Life Cycle Status
top concept of: Life Cycle Status
narrower: Teach Out

Developing
type: Concept
definition: Resource is under development and may or may not become active, current, ongoing, offered, operational, or available.
term status: unstable
in scheme: Life Cycle Status
top concept of: Life Cycle Status

Suspended
type: Concept
definition: Resource is temporarily not active, current, ongoing, offered, operational, or available.
term status: unstable
in scheme: Life Cycle Status
top concept of: Life Cycle Status

Teach Out
type: Concept
definition: Arrangement by which an educational institution provides its current students with the opportunity to complete their course of study when the program, institution or location offering access closes.
term status: unstable
broader: Ceasing
in scheme: Life Cycle Status

And
type: Concept
definition: Relation is satisfied when all of the conditions and constraints are satisfied.
usage note: When used in a Component Condition, this applies to the combination of all immediately subordinate Component Conditions and Constraints.
term status: unstable
equivalent class: and
in scheme: Logical Operator Category
top concept of: Logical Operator Category

Only One
type: Concept
definition: Relation is satisfied when exactly one, and not more, of the conditions or constraints is satisfied.
usage note: When used in a Component Condition, this applies to the combination of all immediately subordinate Component Conditions and Constraints.
term status: unstable
equivalent class: xone
in scheme: Logical Operator Category
top concept of: Logical Operator Category

Or
type: Concept
definition: Relation is satisfied when at least one of the conditions or constraints is satisfied.
usage note: When used in a Component Condition, this applies to the combination of all immediately subordinate Component Conditions and Constraints.
term status: unstable
equivalent class: or
in scheme: Logical Operator Category
top concept of: Logical Operator Category

Assessment Score
type: Concept
definition: Official documentation of a person’s assessment results.
term status: unstable
in scheme: Learning Recognition Evidence Category
top concept of: Learning Recognition Evidence Category

Completion Record
type: Concept
definition: Document verifying successful completion of structured training with an identifiable provider.
description: Applies to employer, community-based, military, or continuing education training.
term status: unstable
in scheme: Learning Recognition Evidence Category
top concept of: Learning Recognition Evidence Category

Credential
type: Concept
definition: Representation of a credential, digital or non-digital, attesting to a person’s achievements.
term status: unstable
in scheme: Learning Recognition Evidence Category
top concept of: Learning Recognition Evidence Category

Credit Recommendation
type: Concept
definition: Recommendation for credit or competency value issued by an authoritative evaluating body, including amount, level, and conditions for specified learning.
description: In the U.S., common sources include ACE credit recommendations.
term status: unstable
in scheme: Learning Recognition Evidence Category
top concept of: Learning Recognition Evidence Category

Employer Attestation
type: Concept
definition: Formal statement from an employer verifying duties, scope of work, and performance relevant to claimed learning.
term status: unstable
in scheme: Learning Recognition Evidence Category
top concept of: Learning Recognition Evidence Category

Hours Verification
type: Concept
definition: Record confirming supervised practice, clinical hours, or comparable time-based experience.
description: Common in clinical, practicum, apprenticeship, or licensure contexts.
term status: unstable
in scheme: Learning Recognition Evidence Category
top concept of: Learning Recognition Evidence Category

Job Verification
type: Concept
definition: Official role description with verification of incumbency and dates.
term status: unstable
in scheme: Learning Recognition Evidence Category
top concept of: Learning Recognition Evidence Category

Military Transcript
type: Concept
definition: Official record of a person’s military education, training, occupations, and related evaluations.
term status: unstable
in scheme: Learning Recognition Evidence Category
top concept of: Learning Recognition Evidence Category

Portfolio
type: Concept
definition: Curated collection of artifacts evidencing learning typically aligned to defined outcomes.
term status: unstable
in scheme: Learning Recognition Evidence Category
top concept of: Learning Recognition Evidence Category

Reflective Narrative
type: Concept
definition: Structured reflection connecting prior experience to defined competencies or outcomes.
description: Often required in portfolio submissions. There may be a requirement for commentary or analysis in the narrative.
term status: unstable
in scheme: Learning Recognition Evidence Category
top concept of: Learning Recognition Evidence Category

Résumé Verification
type: Concept
definition: Structured record of experience and education accompanied by sufficient validation for evaluation.
description: Validation may include references, verification letters, or linked evidence.
term status: unstable
in scheme: Learning Recognition Evidence Category
top concept of: Learning Recognition Evidence Category

Skill Profile
type: Concept
definition: Document that maps a person’s work artifacts or experiences to specified competencies, learning outcomes, or course requirements.
description: Improves defensibility and transparency.
term status: unstable
in scheme: Learning Recognition Evidence Category
top concept of: Learning Recognition Evidence Category

Syllabus
type: Concept
definition: Document outlining objectives, content, requirements, schedule, and assessment for a specific course.
description: Supports content and outcome alignment.
term status: unstable
in scheme: Learning Recognition Evidence Category
top concept of: Learning Recognition Evidence Category

Transcript
type: Concept
definition: Official academic record of a person’s achievements issued by the record holder.
description: May be issued by the originating institution or a recognized clearinghouse.
term status: unstable
in scheme: Learning Recognition Evidence Category
top concept of: Learning Recognition Evidence Category

Workplace Learning Record
type: Concept
definition: Documentation of a person's on the job learning.
description: Includes Apprentice Logbooks and similar.
term status: unstable
in scheme: Learning Recognition Evidence Category
top concept of: Learning Recognition Evidence Category

Work Product
type: Concept
definition: Substantive work product demonstrating applied knowledge aligned to defined outcomes.
description: May include reports, designs, code, media, or presentations.
term status: unstable
in scheme: Learning Recognition Evidence Category
top concept of: Learning Recognition Evidence Category

Credit Recommendation Review
type: Concept
definition: An evaluation method that uses an authoritative body’s credit recommendation to determine credit awards.
description: In the U.S., examples include American Council on Education (ACE) credit recommendations.
term status: unstable
in scheme: Learning Recognition Method Category
top concept of: Learning Recognition Method Category

External Training Evaluation
type: Concept
definition: An evaluation method in which structured, external non-academic training is reviewed to award credit or standing.
description: May be conducted by employer, third-party, vendor, or external credentialing organization.
term status: unstable
in scheme: Learning Recognition Method Category
top concept of: Learning Recognition Method Category

Faculty-Developed Examination
type: Concept
definition: A method in which learning is assessed by a course-specific exam created and administered by faculty.
description: In the United States, examples include challenge exams.
term status: unstable
in scheme: Learning Recognition Method Category
top concept of: Learning Recognition Method Category

Faculty Transfer Evaluation
type: Concept
definition: An evaluation method in which faculty subject-matter experts judge whether prior learning meets course outcomes.
term status: unstable
in scheme: Learning Recognition Method Category
top concept of: Learning Recognition Method Category

Individualized Prior Learning Assessment
type: Concept
definition: An evaluation method that uses personalized approaches to assess learning.
description: Examples include portfolio review, simulation, and interview.
term status: unstable
in scheme: Learning Recognition Method Category
top concept of: Learning Recognition Method Category

Institution-Developed Assessment
type: Concept
definition: A method in which institution-created assessments are used to determine credit for prior learning.
description: Examples include challenge exams, projects, and labs.
term status: unstable
in scheme: Learning Recognition Method Category
top concept of: Learning Recognition Method Category

International Credit Evaluation
type: Concept
definition: An evaluation method in which learning or credit earned from organizations in other countries is reviewed for recognition.
term status: unstable
in scheme: Learning Recognition Method Category
top concept of: Learning Recognition Method Category

Portfolio Assessment
type: Concept
definition: A method in which a learner-developed portfolio is assessed to evidence prior learning aligned to defined outcomes.
description: Examples include documentation, work products, and artifacts mapped to competencies or requirements.
term status: unstable
in scheme: Learning Recognition Method Category
top concept of: Learning Recognition Method Category

Prior Learning Assessment
type: Concept
definition: A structured method used to evaluate an individual's prior learning and its applicability to requirements.
term status: unstable
in scheme: Learning Recognition Method Category
top concept of: Learning Recognition Method Category

Proficiency Examination
type: Concept
definition: A method in which learning is assessed by an exam used to demonstrate subject mastery for placement or credit.
description: May be internal or external; use Standardized Examination when using recognized national/international exams.
term status: unstable
in scheme: Learning Recognition Method Category
top concept of: Learning Recognition Method Category

Standardized Examination
type: Concept
definition: A method in which learning is assessed by a recognized standardized exam administered by an authoritative body.
description: In the United States, examples include AP, CLEP, DLPT.
term status: unstable
in scheme: Learning Recognition Method Category
top concept of: Learning Recognition Method Category

Transcript Evaluation
type: Concept
definition: An evaluation method in which prior records are reviewed to determine applicability.
term status: unstable
in scheme: Learning Recognition Method Category
top concept of: Learning Recognition Method Category

Transfer Credit Evaluation
type: Concept
definition: An evaluation method that provides a preliminary determination of transferability using supplied records before matriculation.
term status: unstable
in scheme: Learning Recognition Method Category
top concept of: Learning Recognition Method Category

Advanced Standing
type: Concept
definition: An outcome in which standing toward a program or qualification is granted, which may or may not carry transcripted credit.
term status: unstable
in scheme: Learning Recognition Outcome Category
top concept of: Learning Recognition Outcome Category

Credit Awarded
type: Concept
definition: An outcome in which learning results in transcripted credit.
term status: unstable
in scheme: Learning Recognition Outcome Category
top concept of: Learning Recognition Outcome Category

Credit Equivalency
type: Concept
definition: An outcome in which learning fulfills a credit requirement.
term status: unstable
in scheme: Learning Recognition Outcome Category
top concept of: Learning Recognition Outcome Category

Eligibility Met
type: Concept
definition: An outcome in which a prerequisite, admission, or other eligibility requirement is satisfied by recognized learning.
term status: unstable
in scheme: Learning Recognition Outcome Category
top concept of: Learning Recognition Outcome Category

Exemption Waiver
type: Concept
definition: An outcome in which a requirement is waived.
term status: unstable
in scheme: Learning Recognition Outcome Category
top concept of: Learning Recognition Outcome Category

Not Recognized
type: Concept
definition: An outcome in which an evaluation is completed but no recognition is granted.
term status: unstable
in scheme: Learning Recognition Outcome Category
top concept of: Learning Recognition Outcome Category

Placement
type: Concept
definition: An outcome in which a person is placed into a program, hired or promoted.
term status: unstable
in scheme: Learning Recognition Outcome Category
top concept of: Learning Recognition Outcome Category

Recognition Only
type: Concept
definition: An outcome in which learning is acknowledged for placement, exemption, or eligibility without awarding credit.
term status: unstable
in scheme: Learning Recognition Outcome Category
top concept of: Learning Recognition Outcome Category

Apprenticeship
type: Concept
definition: Learning completed in a registered apprenticeship program.
term status: unstable
in scheme: Learning Recognition Source Category
top concept of: Learning Recognition Source Category

Clinical Practicum
type: Concept
definition: Learning acquired through supervised clinical or practicum experiences in applied professional settings aligned to program or licensure standards.
term status: unstable
in scheme: Learning Recognition Source Category
top concept of: Learning Recognition Source Category

Community-Based Organization Training
type: Concept
definition: Learning completed through structured training delivered by a community-based organization.
term status: unstable
in scheme: Learning Recognition Source Category
top concept of: Learning Recognition Source Category

Community Service
type: Concept
definition: Learning acquired through unpaid service activities performed for the benefit of a community or organization outside a formal curriculum or assessed program.
term status: unstable
in scheme: Learning Recognition Source Category
top concept of: Learning Recognition Source Category

Continuing Education
type: Concept
definition: Learning completed through structured, non-degree continuing education coursework.
term status: unstable
in scheme: Learning Recognition Source Category
top concept of: Learning Recognition Source Category

Cooperative Education
type: Concept
definition: Learning acquired through extended, alternating work–study placements integrated with an academic program.
term status: unstable
in scheme: Learning Recognition Source Category
top concept of: Learning Recognition Source Category

Course
type: Concept
definition: Learning completed in a course, a structured sequence of educational activities designed to develop prescribed competencies.
term status: unstable
in scheme: Learning Recognition Source Category
top concept of: Learning Recognition Source Category

Custodial Education
type: Concept
definition: Learning completed in educational programs while an individual is incarcerated or in custody.
term status: unstable
in scheme: Learning Recognition Source Category
top concept of: Learning Recognition Source Category

Degree
type: Concept
definition: Learning recognized on the basis of a previously awarded academic degree.
term status: unstable
in scheme: Learning Recognition Source Category
top concept of: Learning Recognition Source Category

Dual Enrollment
type: Concept
definition: Learning completed in college-level coursework taken concurrently with secondary enrollment.
term status: unstable
in scheme: Learning Recognition Source Category
top concept of: Learning Recognition Source Category

Employment-Based Training
type: Concept
definition: Learning completed through formal training provided by an employer or workforce development program.
term status: unstable
in scheme: Learning Recognition Source Category
top concept of: Learning Recognition Source Category

Exam
type: Concept
definition: Learning demonstrated via a recognized examination administered by a national, international, or military body.
term status: unstable
in scheme: Learning Recognition Source Category
top concept of: Learning Recognition Source Category

Experiential Learning
type: Concept
definition: Learning acquired through direct, hands-on experience with guided reflection in real or simulated settings.
term status: unstable
in scheme: Learning Recognition Source Category
top concept of: Learning Recognition Source Category

Accreditation Body
type: Concept
definition: Organization that evaluates other resources such as organizations, learning opportunities, credentials, and/or individuals to issue third-party validation that the resource meets certain standards of quality, competency, and integrity.
term status: unstable
broader: Quality Assurance Body
in scheme: Organization Type

Assessment Body
type: Concept
definition: Primarily offers assessments for credentials as a service.
term status: stable
in scheme: Organization Type
top concept of: Organization Type

Business
type: Concept
definition: Organization that primarily sells products or services and employs one or more individuals.
term status: stable
in scheme: Organization Type
top concept of: Organization Type

Business or Industry Association
type: Concept
definition: Membership organization primarily engaged in promoting the interests of their business members and providing them with services that may involve the provision of education and credentialing services.
term status: stable
in scheme: Organization Type
top concept of: Organization Type

Certification Body
type: Concept
definition: Independent, third-party organization that operates a certification program. A certification body may or may not be governmental, and may or may not have regulatory authority.
term status: stable
in scheme: Organization Type
top concept of: Organization Type

Collaborative
type: Concept
definition: Organized group of entities in the public, private, government sectors that collaborates to achieve a common set of goals.
term status: stable
in scheme: Organization Type
top concept of: Organization Type

Coordinating Body
type: Concept
definition: An organization that organizes multiple stakeholders around a common goal.
term status: stable
in scheme: Organization Type
top concept of: Organization Type

Four-Year College
type: Concept
definition: Authorized postsecondary institution that primarily offers bachelor or higher degrees, but may also award associate degrees.
description: Includes free-standing medical, law or other first-professional schools, schools that offer postbaccalaureate certificates only, those that offer graduate programs only, etc.
term status: stable
broader: Postsecondary Educational Institution
in scheme: Organization Type

Government Agency
type: Concept
definition: Organization in the public sector at the federal, state or local levels.
description: Includes quasi-governmental organizations, special districts (e.g., libraries), corrections organizations, etc., except college and school districts. Is also responsible for the oversight and administration of specific functions other than the military services.
term status: stable
in scheme: Organization Type
top concept of: Organization Type

High School
type: Concept
definition: Secondary school providing instruction and educational services that do not focus primarily on career and technical education or alternative education.
term status: stable
broader: Secondary School
in scheme: Organization Type

Labor Union
type: Concept
definition: Membership organization of workers formed for the purpose of advancing its members' interests in respect to wages, benefits, and working conditions.
term status: stable
in scheme: Organization Type
top concept of: Organization Type

Lower Secondary School
type: Concept
definition: School primarily offering programs at the first stage of secondary education building on primary education, typically with a more subject-oriented curriculum.
usage note: Use for Middle School.
term status: unstable
broader: Secondary School
in scheme: Organization Type

Magnet/Competitive Admissions School
type: Concept
definition: Public school offering special instruction and programs not available elsewhere, designed to attract a more diverse student body from throughout a school district.
term status: stable
broader: Secondary School
in scheme: Organization Type

Military
type: Concept
definition: Armed services of a government entity.
term status: stable
in scheme: Organization Type
top concept of: Organization Type

Alternative/Non-Traditional School
type: Concept
definition: Secondary (i.e., high school) that: 1) addresses needs of students which cannot typically be met in a regular school; 2) provides nontraditional education; 3) falls outside of the categories of regular, magnet/special program emphasis, or career and technical education.
term status: stable
broader: Secondary School
in scheme: Organization Type

Postsecondary Educational Institution
type: Concept
definition: Organization such as a college or university.
description: Organization with the authority to award degrees, and whose primary purpose is to provide postsecondary (tertiary or non-tertiary) education including programs whose purpose is providing academic, vocational, and continuing professional education.
term status: stable
in scheme: Organization Type
top concept of: Organization Type
narrower: Four-Year College
narrower: Two-Year College

Primarily Online
type: Concept
definition: Organization that primarily operates online.
term status: stable
in scheme: Organization Type
top concept of: Organization Type

Primary School
type: Concept
definition: School primarily offering programs designed to provide students with fundamental skills in reading, writing and mathematics and to establish a solid foundation for learning.
term status: unstable
in scheme: Organization Type
top concept of: Organization Type

Professional Association
type: Concept
definition: Membership organization primarily engaged in promoting the interests of a particular profession, the interests of individuals engaged in that profession, and providing them with services that may involve the provision of education and credentialing services.
term status: stable
in scheme: Organization Type
top concept of: Organization Type

Quality Assurance Body
type: Concept
definition: External body that performs accreditation, endorsement, approval, and/or recognition of a credential issuer.
term status: stable
in scheme: Organization Type
top concept of: Organization Type
narrower: Accreditation Body
narrower: Regulator

Regulator
type: Concept
definition: Organization that regulates other resources such as organizations, learning opportunities, credentials, and/or individuals against established standards and criteria.
term status: unstable
broader: Quality Assurance Body
in scheme: Organization Type

Secondary School
type: Concept
definition: School offering programs at all levels of secondary education, building on primary education through to preparing for tertiary education or providing skills relevant to employment.
usage note: Use for schools that cover both Lower and Upper Secondary levels.
term status: stable
in scheme: Organization Type
top concept of: Organization Type
narrower: High School
narrower: Lower Secondary School
narrower: Magnet/Competitive Admissions School
narrower: Alternative/Non-Traditional School
narrower: Career and Technical School
narrower: Upper Secondary School

Career and Technical School
type: Concept
definition: Secondary school that focuses primarily on providing formal preparation for skilled, technical or professional occupations or careers.
term status: stable
broader: Secondary School
in scheme: Organization Type

Education and Training Provider
type: Concept
definition: Organization whose major purpose is to provide education and training services but is not a postsecondary education institution with the authority to award degrees.
description: Includes community-based organizations, non-degree granting proprietary schools which are education and training providers that are recognized by states as schools.
usage note: In the U.S., use for Title IV eligible organizations that do not award degrees.
term status: stable
in scheme: Organization Type
top concept of: Organization Type

Two-Year College
type: Concept
definition: Authorized postsecondary institution that primarily offers associate degrees and certificates, and, if authorized, may also award higher degrees.
description: Includes occupational and vocational schools with programs of at least 1800 hours, academic institutions with programs of less than 4 years, etc.
term status: stable
broader: Postsecondary Educational Institution
in scheme: Organization Type

Upper Secondary School
type: Concept
definition: School primarily offering programs at the final stage of secondary education preparing for tertiary education or providing skills relevant to employment, usually with an increased range of subject options and streams.
term status: unstable
broader: Secondary School
in scheme: Organization Type

Vendor
type: Concept
definition: Sells, maintains, and issues credentials for its own products and services for public access and use.
term status: stable
in scheme: Organization Type
top concept of: Organization Type

In-State
type: Concept
definition: Legal residency or domicile status of the agent is the state or province of the relevant activity.
term status: stable
in scheme: Residency
top concept of: Residency

Foreign/International
type: Concept
definition: Legal residency, domicile, or citizen status of the agent is as a foreign national.
term status: stable
in scheme: Residency
top concept of: Residency

Local
type: Concept
definition: Legal residency or domicile status of the agent is local.
term status: stable
in scheme: Residency
top concept of: Residency

Out-of-State
type: Concept
definition: Legal residency or domicile status of the agent is a state or province different from the state or provincial locus of the relevant activity.
term status: stable
in scheme: Residency
top concept of: Residency

Regional
type: Concept
definition: Legal residency or domicile status of the agent is the same geographic or political region as that of the relevant activity.
term status: stable
in scheme: Residency
top concept of: Residency

Annually
type: Concept
definition: Schedule is on an annual basis, typically occurring once per year.
term status: unstable
in scheme: Schedule Frequency
top concept of: Schedule Frequency

Bi-Monthly
type: Concept
definition: Schedule is on a bi-monthly basis, typically occurring every other month.
term status: unstable
in scheme: Schedule Frequency
top concept of: Schedule Frequency

Event-Based
type: Concept
definition: Schedule is determined or triggered by other events, such as completion of activities, completion of the resource, events external to the resource, or other events; refer to the resource's information for details.
term status: unstable
in scheme: Schedule Frequency
top concept of: Schedule Frequency

Irregular
type: Concept
definition: Schedule has no significant pattern.
term status: unstable
in scheme: Schedule Frequency
top concept of: Schedule Frequency

Monthly
type: Concept
definition: Schedule is on a monthly basis, typically occurring once per month.
term status: unstable
in scheme: Schedule Frequency
top concept of: Schedule Frequency

Multiple Per Week
type: Concept
definition: Schedule is more frequent than a weekly basis.
term status: unstable
in scheme: Schedule Frequency
top concept of: Schedule Frequency

On-Demand
type: Concept
definition: Schedule allows the participant to choose when the resource begins.
term status: unstable
in scheme: Schedule Frequency
top concept of: Schedule Frequency

Open Entry/Exit
type: Concept
definition: Schedule allows for the participant to enter, participate with, and complete the resource during any period of the resource's run time.
term status: unstable
in scheme: Schedule Frequency
top concept of: Schedule Frequency

Quarterly
type: Concept
definition: Schedule is on an quarterly basis, typically occurring three or four times per year.
term status: unstable
in scheme: Schedule Frequency
top concept of: Schedule Frequency

Self-Paced
type: Concept
definition: Schedule allows for participation at a self-determined pace, though some specific dates and deadlines may be involved.
term status: unstable
in scheme: Schedule Frequency
top concept of: Schedule Frequency

Semi-Annually
type: Concept
definition: Schedule is on an semi-annual basis, typically occurring twice per year.
term status: unstable
in scheme: Schedule Frequency
top concept of: Schedule Frequency

Single Instance
type: Concept
definition: Schedule is a single instance of this event.
term status: unstable
in scheme: Schedule Frequency
top concept of: Schedule Frequency

Weekly
type: Concept
definition: Schedule is on a weekly basis, typically occurring once per week.
term status: unstable
in scheme: Schedule Frequency
top concept of: Schedule Frequency

Daytime
type: Concept
definition: Schedule is typically during daytime hours.
term status: unstable
in scheme: Schedule Timing
top concept of: Schedule Timing

Evening
type: Concept
definition: Schedule is typically during evening hours.
term status: unstable
in scheme: Schedule Timing
top concept of: Schedule Timing

Weekdays
type: Concept
definition: Schedule is Monday through Friday, consecutively or non-consecutively.
term status: unstable
in scheme: Schedule Timing
top concept of: Schedule Timing

Weekends
type: Concept
definition: Schedule is on a weekly basis, Saturday and/or Sunday.
term status: unstable
in scheme: Schedule Timing
top concept of: Schedule Timing

Criterion-Referenced
type: Concept
definition: Scored based on a comparison to defined criteria and levels of performance.
term status: stable
in scheme: Scoring Method
top concept of: Scoring Method

Norm-Referenced
type: Concept
definition: Scored based on a comparison to a distribution of performance in a reference population.
term status: stable
in scheme: Scoring Method
top concept of: Scoring Method

Accredit Service
type: Concept
definition: Agent service provides official authorization to, or approval of, a credential, organization or program based on prescribed standards or criteria.
term status: stable
in scheme: Agent Service Type
top concept of: Agent Service Type

Approve Service
type: Concept
definition: Agent service official accepts a credential or authorizes an organization to act or operate.
term status: stable
in scheme: Agent Service Type
top concept of: Agent Service Type

Offer Service
type: Concept
definition: Agent service offers resources such as credentials, assessments, or learning opportunities.
term status: stable
in scheme: Agent Service Type
top concept of: Agent Service Type

Recognize Service
type: Concept
definition: Agent service recommends, endorses, indicates preference for, or otherwise provides a positive judgment.
term status: stable
in scheme: Agent Service Type
top concept of: Agent Service Type

Regulate Service
type: Concept
definition: Agent service monitors and enforces legal requirements or standards.
term status: stable
in scheme: Agent Service Type
top concept of: Agent Service Type

Renew Service
type: Concept
definition: Agent provides service to extend (renew) the validity of a credential.
term status: stable
in scheme: Agent Service Type
top concept of: Agent Service Type

Revoke Service
type: Concept
definition: Agent provides service to end (revoke) the validity or operation of an awarded credential.
term status: stable
in scheme: Agent Service Type
top concept of: Agent Service Type

Development Related
type: Concept
definition: Statement that defines commitments to joint development or future collaboration.
description: May include curriculum alignment, program expansion, or new partnerships.
term status: unstable
in scheme: Statement Category
top concept of: Statement Category

Equivalency Request Related
type: Concept
definition: Statement that defines how a person requests determination of equivalency between an external academic resource and a receiving institution’s resource.
description: Covers process for course, credential, or program equivalency review.
term status: unstable
in scheme: Statement Category
top concept of: Statement Category

Guarantee
type: Concept
definition: Statement that assures a condition, right, or outcome within the agreement.
description: May include guarantees of credit acceptance, recognition, or services.
term status: unstable
in scheme: Statement Category
top concept of: Statement Category

Learning Recognition Evidence Related
type: Concept
definition: Statement that defines how evidence of prior learning evidence is accepted for evaluation.
term status: unstable
in scheme: Statement Category
top concept of: Statement Category

Learning Recognition Method Related
type: Concept
definition: Statement that defines the method(s) used to evaluate and recognize prior learning.
term status: unstable
in scheme: Statement Category
top concept of: Statement Category

Learning Recognition Outcome Related
type: Concept
definition: Statement that defines the outcomes that are possible after evaluation of evidence of prior learning.
term status: unstable
in scheme: Statement Category
top concept of: Statement Category

Learning Recognition Request Related
type: Concept
definition: Statement that defines how a person submits a request for recognition of prior learning.
description: Covers submission steps, forms or portals, timelines, fees, and evidence requirements.
term status: unstable
in scheme: Statement Category
top concept of: Statement Category

Learning Recognition Source Related
type: Concept
definition: Statement that defines the context from which prior learning may be recognized.
term status: unstable
in scheme: Statement Category
top concept of: Statement Category

Limitation
type: Concept
definition: Statement that specifies a restriction or boundary on applicability.
description: Defines conditions under which transfer or recognition does not apply.
term status: unstable
in scheme: Statement Category
top concept of: Statement Category

Marketing Related
type: Concept
definition: Statement that defines provisions for promoting the agreement.
description: Covers branding, logos, co-marketing, and public announcements.
term status: unstable
in scheme: Statement Category
top concept of: Statement Category

Metric Related
type: Concept
definition: Statement that defines measures or performance indicators relevant to the agreement.
description: May include success rates, persistence, or evaluation metrics.
term status: unstable
in scheme: Statement Category
top concept of: Statement Category

Mutual Obligation
type: Concept
definition: Obligation that applies equally to all parties in the agreement.
description: Often covers shared responsibilities such as maintaining accreditation.
term status: unstable
broader: Obligation
in scheme: Statement Category

Notice Period
type: Concept
definition: Statement that defines the time required for advance notice of actions such as termination or renewal.
description: Often expressed in days, months, or academic terms.
term status: unstable
in scheme: Statement Category
top concept of: Statement Category

Obligation
type: Concept
definition: Statement that specifies a duty or responsibility under the agreement.
description: Parent concept for mutual, sender, and receiver obligations.
term status: unstable
in scheme: Statement Category
top concept of: Statement Category
narrower: Mutual Obligation
narrower: Receiver Obligation
narrower: Sender Obligation

Overview
type: Concept
definition: Statement that summarizes the scope or general provisions of the agreement.
description: Provides a high-level description without detailed terms.
term status: unstable
in scheme: Statement Category
top concept of: Statement Category

Purpose
type: Concept
definition: Statement that explains the intent or rationale of the agreement.
description: Clarifies why the agreement exists and what it seeks to achieve.
term status: unstable
in scheme: Statement Category
top concept of: Statement Category

Receiver Obligation
type: Concept
definition: Obligation that applies to the receiving party in the agreement.
description: May include evaluating equivalency, applying transfer credit, or notifying learners.
term status: unstable
broader: Obligation
in scheme: Statement Category

Sender Obligation
type: Concept
definition: Obligation that applies to the sending party in the agreement.
description: May include providing transcripts, data, or verifying learning.
term status: unstable
broader: Obligation
in scheme: Statement Category

Termination Terms
type: Concept
definition: Statement that defines conditions for ending the agreement.
description: Includes triggers, procedures, and effective dates for termination.
term status: unstable
in scheme: Statement Category
top concept of: Statement Category

Academic Advising
type: Concept
definition: Personalized process that assists people in achieving educational goals and navigating academic journeys.
term status: unstable
in scheme: Support Service Category
top concept of: Support Service Category

Assistive Technology Support
type: Concept
definition: Service that directly assists an individual in the selection, acquisition, or use of assistive technology devices.
term status: unstable
narrow match: https://ceds.ed.gov/element/000273/#00292
in scheme: Support Service Category
top concept of: Support Service Category

Audiological Health Care
type: Concept
definition: Health care and related services covering hearing loss or impairment.
term status: unstable
related match: https://ceds.ed.gov/element/000273/#00293
in scheme: Support Service Category
top concept of: Support Service Category

Behavioral Service
type: Concept
definition: Personalized service focused on addressing problem behaviors and developing positive and adaptive behaviors.
term status: unstable
narrow match: https://ceds.ed.gov/element/000273/#73052
in scheme: Support Service Category
top concept of: Support Service Category

Benefits Support
type: Concept
definition: Service that provides guidance and assistance to people in accessing and maintaining the financial and other benefits that can support their academic and career goals.
description: This can include support in understanding and maintaining eligibility, completing related forms, and navigating application and verification processes.
term status: unstable
in scheme: Support Service Category
top concept of: Support Service Category

Career Advising
type: Concept
definition: Personalized process that helps individuals identify and pursue their professional goals, and how to develop the skills and strategies necessary to achieve them.
term status: unstable
in scheme: Support Service Category
top concept of: Support Service Category

Career Assessment
type: Concept
definition: Personalized process that helps individuals to identify their interests, skills, values, and personality traits, and to explore how they relate to different career paths and job opportunities.
term status: unstable
in scheme: Support Service Category
top concept of: Support Service Category

Career Exploration
type: Concept
definition: Service that provides opportunities or information to discover and learn about careers.
description: This service can offer information and experiences about job market trends, salary expectations, working conditions and other factors that can help people identify and pursue their career goals.
term status: unstable
in scheme: Support Service Category
top concept of: Support Service Category

Case Management
type: Concept
definition: Long-term, client-centered service for delivering comprehensive health and human services that involves ongoing assessment, planning, coordination, monitoring, and evaluation of a client's needs and services provided.
term status: unstable
related match: https://ceds.ed.gov/element/000273/#00878
in scheme: Support Service Category
top concept of: Support Service Category

Chatbot
type: Concept
definition: An interactive digital service that answers questions.
description: Format and technology neutral; may be embedded on web pages or portals, may be driven by AI or similar technology.
term status: unstable
in scheme: Support Service Category
top concept of: Support Service Category

Childcare
type: Concept
definition: Provision of supervision, care, and activities for children in the absence of their parents or guardians.
term status: unstable
in scheme: Support Service Category
top concept of: Support Service Category

Clothing Assistance
type: Concept
definition: Service that pays for or provides clothing to people who need appropriate attire.
term status: unstable
narrow match: https://ceds.ed.gov/element/000273/#00319
in scheme: Support Service Category
top concept of: Support Service Category

Computer Hub
type: Concept
definition: Physical location for accessing computers and other technology resources.
term status: unstable
in scheme: Support Service Category
top concept of: Support Service Category

Counseling
type: Concept
definition: Personalized process that helps individuals improve their mental health and well-being by exploring their emotions, behaviors, and relationships with the guidance of a trained professional.
description: Personalized service that provides guidance and support to individuals experiencing personal, work-related, or academic challenges.
term status: unstable
in scheme: Support Service Category
top concept of: Support Service Category

Credit Transfer Tool
type: Concept
definition: Online tool that estimates how previously earned credits or other types of prior learning transfers.
term status: unstable
in scheme: Support Service Category
top concept of: Support Service Category

Crisis Support
type: Concept
definition: Services that provide immediate assistance to people who are facing unexpected challenges or crises that may interfere with their ability to pursue their academic or career goals.
description: These services can include financial assistance, housing assistance, crisis hotlines, and counseling services among others.
term status: unstable
in scheme: Support Service Category
top concept of: Support Service Category

Diversity Equity Inclusion
type: Concept
definition: Services, programs, and initiatives that promote a welcoming and inclusive environment for individuals of all backgrounds.
term status: unstable
in scheme: Support Service Category
top concept of: Support Service Category

Equipment Provision
type: Concept
definition: Service that provides people with access to the equipment, tools, or other physical resources necessary for education, training, or work.
term status: unstable
in scheme: Support Service Category
top concept of: Support Service Category

Financial Literacy
type: Concept
definition: Provides people with the knowledge, skills, and resources necessary to make informed decisions about managing their personal finances.
term status: unstable
in scheme: Support Service Category
top concept of: Support Service Category

Frequently Asked Questions
type: Concept
definition: A curated support resource that provides answers to common questions.
description: Format-neutral; may be web, print, or knowledge-base.
term status: unstable
in scheme: Support Service Category
top concept of: Support Service Category

Health Care
type: Concept
definition: Programs whose primary purpose is to help individuals achieve and maintain physical well-being through the study, prevention, screening, evaluation and treatment of individuals who have illnesses, injuries, or disabilities.
term status: unstable
in scheme: Support Service Category
top concept of: Support Service Category

Immigration Assistance
type: Concept
definition: Assistance for people in navigating legal and administrative procedures involved in immigrating to a new country.
description: Examples include assistance with visa applications, documentation requirements, and settlement services.
term status: unstable
related match: https://ceds.ed.gov/element/000273/#73052
in scheme: Support Service Category
top concept of: Support Service Category

Internet Access
type: Concept
definition: Service where individuals can connect to the internet using their own devices.
term status: unstable
in scheme: Support Service Category
top concept of: Support Service Category

Job Placement
type: Concept
definition: Assistance for individuals in finding suitable work.
description: Examples include providing job searching and matching resources, and facilitating the application, interview, and background check processes.
term status: unstable
in scheme: Support Service Category
top concept of: Support Service Category

Learning Resource Provision
type: Concept
definition: Service that provides people with access to educational materials.
description: Examples of support materials include textbooks, multimedia resources, research papers, journals, and online courses.
usage note: Use for libraries and specialized resource centers.
term status: unstable
in scheme: Support Service Category
top concept of: Support Service Category

Legal Service
type: Concept
definition: Service that provides people with advice, representation, and/or support in navigating the legal system.
description: Examples include the interpretation and application of laws and regulations, and advocating for the individual's legal rights and interests.
term status: unstable
in scheme: Support Service Category
top concept of: Support Service Category

Mental Health Counseling
type: Concept
definition: Personalized service that provides therapeutic support to individuals experiencing mental health issues such as anxiety, depression, or trauma.
description: Examples of mental health issues include behavior problems, emotional disturbances, personality disorders, incipient illnesses, and/or other comparable conditions.
term status: unstable
narrow match: https://ceds.ed.gov/element/000273/#00305
in scheme: Support Service Category
top concept of: Support Service Category

Mentoring
type: Concept
definition: Service that pairs individuals with people experienced in professions who can offer guidance and support as they pursue their academic or career goals.
term status: unstable
in scheme: Support Service Category
top concept of: Support Service Category

Networking
type: Concept
definition: Service that connects people with employers and professional communities to expand their professional networks and gain access to new job opportunities and career pathways.
description: Examples include providing opportunities to attend networking events and connect with professionals.
term status: unstable
in scheme: Support Service Category
top concept of: Support Service Category

Neurodivergence Service
type: Concept
definition: Services related to neurodivergence.
description: Neurodivergence means relating to having a mind that functions in ways that are not considered typical according to societal norms.
usage note: Use for services relating to autism, tics/Tourettes Syndrome, Attention Deficit Hyperactivity Disorder (ADHD), and other similar conditions.
term status: unstable
narrow match: https://ceds.ed.gov/element/000273/#73051
in scheme: Support Service Category
top concept of: Support Service Category

Note Taking Assistance
type: Concept
definition: Service that assists individuals to make their own record of classes or lectures.
term status: unstable
narrow match: https://ceds.ed.gov/element/000273/#00308
in scheme: Support Service Category
top concept of: Support Service Category

Peer Service
type: Concept
definition: Service that specializes in facilitating peer interaction.
description: Examples include peer interactions such as counseling, tutoring, and leadership activities.
term status: unstable
narrow match: https://ceds.ed.gov/element/000273/#00312
in scheme: Support Service Category
top concept of: Support Service Category

Personal Assistance
type: Concept
definition: Personalized service to help and accompany an individual who would otherwise be unable to participate in education, training, and/or work.
term status: unstable
in scheme: Support Service Category
top concept of: Support Service Category

Portfolio Advising
type: Concept
definition: A service that helps learners plan and prepare assessment-ready portfolios aligned to defined outcomes and institutional expectations.
term status: unstable
in scheme: Support Service Category
top concept of: Support Service Category

Postal Address
type: Concept
definition: Service to provide people who do not have a suitable mailing address with a means to receive their mail.
description: This service is intended to help individuals receive documents and correspondence.
term status: unstable
in scheme: Support Service Category
top concept of: Support Service Category

Prior Learning Assessment Advising
type: Concept
definition: A service that guides learners in selecting, documenting, and submitting evidence for recognition of prior learning.
term status: unstable
in scheme: Support Service Category
top concept of: Support Service Category

Psychological Service
type: Concept
definition: Personalized service that provides assessment, diagnosis, and treatment for mental health disorders.
term status: unstable
narrow match: https://ceds.ed.gov/element/000273/#00331
in scheme: Support Service Category
top concept of: Support Service Category

Public Benefits Case Management
type: Concept
definition: Specialized, long-term, and client-centered service for delivering comprehensive public benefits services that involves ongoing assessment, planning, coordination, monitoring, and evaluation of a client's needs and services provided related to public assistance programs.
term status: unstable
related match: https://ceds.ed.gov/element/000273/#00294
in scheme: Support Service Category
top concept of: Support Service Category

Reader Service
type: Concept
definition: Service for reading text or describing visual content.
usage note: For pre-recorded formats such as audio books use the accommodationType property with the value "AlternativeFormats".
term status: unstable
narrow match: https://ceds.ed.gov/element/000273/#00314
in scheme: Support Service Category
top concept of: Support Service Category

Rehabilitation
type: Concept
definition: Service that provides a combination of treatment and education designed to restore maximum functioning, independence, and a sense of well-being for individuals who have temporary or permanent disabilities.
term status: unstable
narrow match: https://ceds.ed.gov/element/000273/#00318
in scheme: Support Service Category
top concept of: Support Service Category

Residential Living
type: Concept
definition: Service that provides a therapeutic living environment in community-based residential facilities for individuals with special needs, including those with emotional and/or behavioral problems.
term status: unstable
narrow match: https://ceds.ed.gov/element/000273/#00885
in scheme: Support Service Category
top concept of: Support Service Category

Respite Care
type: Concept
definition: Service that provides temporary care to relieve a caregiver.
term status: unstable
narrow match: https://ceds.ed.gov/element/000273/#73046
in scheme: Support Service Category
top concept of: Support Service Category

Sign Language
type: Concept
definition: Service that provides sign language interpretation.
term status: unstable
narrow match: https://ceds.ed.gov/element/000273/#73058
in scheme: Support Service Category
top concept of: Support Service Category

Skill Mapping
type: Concept
definition: Service that helps identify and assess an individual's specific skills and qualifications to determine any gaps or overlaps in their knowledge or experience as they relate to a career pathway.
description: This process can identify opportunities for advanced standing, transfer credit, or other forms of recognition for their skills, which can help people save time and money in pursuit of their education or career goals.
term status: unstable
in scheme: Support Service Category
top concept of: Support Service Category

Study Skills
type: Concept
definition: Service that provides assistance for people who want to improve their study habits, test preparation skills and test-taking techniques.
term status: unstable
narrow match: https://ceds.ed.gov/element/000273/#00323
in scheme: Support Service Category
top concept of: Support Service Category

Substance Abuse Prevention
type: Concept
definition: Service related to preventing the misuse or abuse of drugs, alcohol, or other substances.
term status: unstable
narrow match: https://ceds.ed.gov/element/000273/#00324
in scheme: Support Service Category
top concept of: Support Service Category

Support Coordination
type: Concept
definition: Service that involves coordinating and integrating various other services to provide comprehensive support to individuals.
description: Support coordination emphasizes a holistic and personalized approach where services are delivered in a comprehensive manner, rather than in isolation.
usage note: Use for services known as "wraparound services" in the U.S.
term status: unstable
in scheme: Support Service Category
top concept of: Support Service Category

Supported Work
type: Concept
definition: Service that helps people with special needs find and retain paid work.
description: This can include advocacy and support services to address behaviors and basic skills required to stay employed.
term status: unstable
narrow match: https://ceds.ed.gov/element/000273/#00886
in scheme: Support Service Category
top concept of: Support Service Category

Talent Marketplace Signaling
type: Concept
definition: Service that enables employers to provide information that helps education and training providers align their offerings to current and future job opportunities.
term status: unstable
in scheme: Support Service Category
top concept of: Support Service Category

Technology Lending
type: Concept
definition: Service that loans out technology equipment such as laptops, tablets, and other devices.
term status: unstable
narrow match: https://ceds.ed.gov/element/000273/#00887
in scheme: Support Service Category
top concept of: Support Service Category

Test Assistance
type: Concept
definition: Service that provides assistance for people who need help in reading or writing responses to test items.
term status: unstable
narrow match: https://ceds.ed.gov/element/000273/#00326
in scheme: Support Service Category
top concept of: Support Service Category

Transfer Admission
type: Concept
definition: Service that provides information and support about the criteria and process for students applying as transfer candidates rather than first-time freshmen.
term status: unstable
in scheme: Support Service Category
top concept of: Support Service Category

Transfer Advising
type: Concept
definition: A service that helps learners understand transfer options and applicability and plan efficient pathways to their goals.
description: Covers guidance on policies, prerequisites, timelines, and required documentation.
term status: unstable
in scheme: Support Service Category
top concept of: Support Service Category

Transfer Equivalency Tool
type: Concept
definition: Searchable system showing how courses from other institutions equate to local offerings.
term status: unstable
in scheme: Support Service Category
top concept of: Support Service Category

Transfer Outreach Event
type: Concept
definition: An event-based support service that informs and engages prospective transfer learners about pathways, policies, and resources.
description: Includes fairs, info sessions, and campus visit programming.
term status: unstable
in scheme: Support Service Category
top concept of: Support Service Category

Transfer Timeline
type: Concept
definition: A support resource that outlines recommended steps and deadlines for completing transfer and recognition processes.
description: Can be generalized or program-specific.
term status: unstable
in scheme: Support Service Category
top concept of: Support Service Category

Translation
type: Concept
definition: Service that provides spoken or written language translation.
usage note: For sign language, use Sign Language Service
term status: unstable
related match: https://ceds.ed.gov/element/000273/#00327
in scheme: Support Service Category
top concept of: Support Service Category

Transportation
type: Concept
definition: Service that provides or arranges transportation for people.
term status: unstable
narrow match: https://ceds.ed.gov/element/000273/#00888
narrow match: https://ceds.ed.gov/element/000273/#00321
in scheme: Support Service Category
top concept of: Support Service Category

Tutoring
type: Concept
definition: Individualized or small group teaching.
usage note: Tutoring as a support service is normally provided as a supplement to a regular teaching program.
term status: unstable
narrow match: https://ceds.ed.gov/element/000273/#00329
in scheme: Support Service Category
top concept of: Support Service Category

Vision Service
type: Concept
definition: Health care and related services related to vision loss or impairment.
term status: unstable
narrow match: https://ceds.ed.gov/element/000273/#00330
in scheme: Support Service Category
top concept of: Support Service Category