Action Status
type: ConceptScheme
comment: Types of current status of an action.
description: Available statuses include ActiveActionStatus, CompletedActionStatus, FailedActionStatus, PotentialActionStatus.
term status: stable
change history: https://credreg.net/ctdl/termhistory/ceterms/ActionStatus/json
equivalent class: ActionStatus
has concept: Active Action Status
has concept: Completed Action Status
has concept: Failed Action Status
has concept: Potential Action Status
has top concept: Active Action Status
has top concept: Completed Action Status
has top concept: Failed Action Status
has top concept: Potential Action Status

Active Action Status
type: Concept
definition: Action that is ongoing.
description: Examples include: while watching the movie, or driving to a location
term status: stable
change history: https://credreg.net/ctdl/termhistory/actionStat/ActiveActionStatus/json
in scheme: Action Status
top concept of: Action Status

Completed Action Status
type: Concept
definition: Action that has already taken place.
term status: stable
change history: https://credreg.net/ctdl/termhistory/actionStat/CompletedActionStatus/json
in scheme: Action Status
top concept of: Action Status

Failed Action Status
type: Concept
definition: Action that failed to complete.
description: The action's error property and the HTTP return code contain more information about the failure.
term status: stable
change history: https://credreg.net/ctdl/termhistory/actionStat/FailedActionStatus/json
in scheme: Action Status
top concept of: Action Status

Potential Action Status
type: Concept
definition: Description of an action that is supported.
term status: stable
change history: https://credreg.net/ctdl/termhistory/actionStat/PotentialActionStatus/json
in scheme: Action Status
top concept of: Action Status