Agent Sector
type: ConceptScheme
comment: Types of sociological, economic, or political subdivision of society.
description: Sectors include public, private for profit, public for profit, and business industry association.
term status: stable
change history: https://credreg.net/ctdl/termhistory/ceterms/AgentSector/json
has concept: Private For-Profit
has concept: Private Not-For-Profit
has concept: Public
has top concept: Private For-Profit
has top concept: Private Not-For-Profit
has top concept: Public

Private For-Profit
type: Concept
definition: Sector that contains privately-owned organizations that operate for profit.
term status: stable
change history: https://credreg.net/ctdl/termhistory/agentSector/PrivateForProfit/json
in scheme: Agent Sector
top concept of: Agent Sector

Private Not-For-Profit
type: Concept
definition: Sector that contains privately-owned organizations that operate on a non-profit basis.
description: These include both independent not-for-profit schools and those affiliated with a religious organization.
term status: stable
change history: https://credreg.net/ctdl/termhistory/agentSector/PrivateNonProfit/json
in scheme: Agent Sector
top concept of: Agent Sector

Public
type: Concept
definition: Sector that contains government and quasi-government organizations.
term status: stable
change history: https://credreg.net/ctdl/termhistory/agentSector/Public/json
in scheme: Agent Sector
top concept of: Agent Sector