Agent Service Type
type: ConceptScheme
comment: Types of services offered by an agent.
term status: stable
change history: https://credreg.net/ctdl/termhistory/ceterms/AgentServiceType/json
has concept: Accredit Service
has concept: Approve Service
has concept: Offer Service
has concept: Recognize Service
has concept: Regulate Service
has concept: Renew Service
has concept: Revoke Service
has top concept: Accredit Service
has top concept: Approve Service
has top concept: Offer Service
has top concept: Recognize Service
has top concept: Regulate Service
has top concept: Renew Service
has top concept: Revoke Service

Accredit Service
type: Concept
definition: Agent service provides official authorization to, or approval of, a credential, organization or program based on prescribed standards or criteria.
term status: stable
change history: https://credreg.net/ctdl/termhistory/serviceType/AccreditService/json
in scheme: Agent Service Type
top concept of: Agent Service Type

Approve Service
type: Concept
definition: Agent service official accepts a credential or authorizes an organization to act or operate.
term status: stable
change history: https://credreg.net/ctdl/termhistory/serviceType/ApproveService/json
in scheme: Agent Service Type
top concept of: Agent Service Type

Offer Service
type: Concept
definition: Agent service offers resources such as credentials, assessments, or learning opportunities.
term status: stable
change history: https://credreg.net/ctdl/termhistory/serviceType/OfferService/json
in scheme: Agent Service Type
top concept of: Agent Service Type

Recognize Service
type: Concept
definition: Agent service recommends, endorses, indicates preference for, or otherwise provides a positive judgment.
term status: stable
change history: https://credreg.net/ctdl/termhistory/serviceType/RecognizeService/json
in scheme: Agent Service Type
top concept of: Agent Service Type

Regulate Service
type: Concept
definition: Agent service monitors and enforces legal requirements or standards.
term status: stable
change history: https://credreg.net/ctdl/termhistory/serviceType/RegulateService/json
in scheme: Agent Service Type
top concept of: Agent Service Type

Renew Service
type: Concept
definition: Agent provides service to extend (renew) the validity of a credential.
term status: stable
change history: https://credreg.net/ctdl/termhistory/serviceType/RenewService/json
in scheme: Agent Service Type
top concept of: Agent Service Type

Revoke Service
type: Concept
definition: Agent provides service to end (revoke) the validity or operation of an awarded credential.
term status: stable
change history: https://credreg.net/ctdl/termhistory/serviceType/RevokeService/json
in scheme: Agent Service Type
top concept of: Agent Service Type