Assessment Component
type: Class
comment: Resource that identifies a direct, indirect, formative, and summative evaluation or estimation of the nature, ability, or quality of a resource, performance, or outcome of an action.
term status: stable
change history: https://credreg.net/ctdl/termhistory/ceterms/AssessmentComponent/json
subclass of: PathwayComponent
domain for: description
domain for: hasCondition
domain for: isDestinationComponentOf
domain for: name
domain for: pointValue
domain for: precedes
domain for: prerequisite
domain for: sourceData
domain for: subjectWebpage