Assessment Method
type: ConceptScheme
comment: Types of assessment method.
term status: stable
change history: https://credreg.net/ctdl/termhistory/ceterms/AssessmentMethod/json
has concept: Artifact
has concept: Exam
has concept: Performance
has top concept: Artifact
has top concept: Exam
has top concept: Performance

Artifact
type: Concept
definition: Work or product created or produced by the person being assessed.
description: Artifact includes, but is not limited to, an academic paper, video documentary, computer software, music composition, choreography, novel, short story, journal article, news article, report, lesson plan, product design, portfolio, manufactured product, etc. Methods of evaluation may include multiple evaluators either individually or as an expert panel using general criteria or more structured rubrics whose scores are combined, etc. Criteria and methods of evaluation are often very similar to those for assessing a performance, without the facets specific to a live performance
term status: stable
change history: https://credreg.net/ctdl/termhistory/assessMethod/Artifact/json
in scheme: Assessment Method
top concept of: Assessment Method

Exam
type: Concept
definition: Mix of scored items presented in fixed or open response formats including qualifying and comprehensive exams.
description: Exam includes, but is not limited to, multiple choice, true-false, written essay, short-answer, fill-in or oral response formats that could include measurements of reasoning, problem-solving, critical thinking.
term status: stable
change history: https://credreg.net/ctdl/termhistory/assessMethod/Exam/json
in scheme: Assessment Method
top concept of: Assessment Method

Performance
type: Concept
definition: Set of behaviors or actions assessed as demonstration of competencies where the assessment occurs either as the actions take place (i.e., live) or through review of recordings of those actions in a persistent media (e.g., video, audio, keystroke records, etc.)
description: Performance includes, but is not limited to, dance, music, teaching, acting, medical procedures, truck driving, manufacturing production, etc. Criteria include the categories and benchmarks on which the performance is assessed. Methods of evaluation can include multiple evaluators either individually or as an expert panel using general criteria or more structured rubrics whose scores are combined (e.g., assessing a dance performance, evaluating the performance of a medical procedure, truck driving procedure, manufacturing process such as machining).
term status: stable
change history: https://credreg.net/ctdl/termhistory/assessMethod/Performance/json
in scheme: Assessment Method
top concept of: Assessment Method