Assessment Use
type: ConceptScheme
comment: Types of Intended uses of an assessment.
term status: stable
change history: https://credreg.net/ctdl/termhistory/ceterms/AssessmentUse/json
has concept: Formative Assessment
has concept: Summative Assessment
has top concept: Formative Assessment
has top concept: Summative Assessment

Formative Assessment
type: Concept
definition: Formal and informal assessment procedures conducted during the learning process to support intentional modification in teaching and learning activities in order to improve learner attainment.
term status: stable
change history: https://credreg.net/ctdl/termhistory/assessUse/Formative/json
in scheme: Assessment Use
top concept of: Assessment Use

Summative Assessment
type: Concept
definition: Assessment of learning at the end of an instructional unit to determine whether some established standard or benchmark has been achieved.
term status: stable
change history: https://credreg.net/ctdl/termhistory/assessUse/Summative/json
in scheme: Assessment Use
top concept of: Assessment Use