Audience Level
type: ConceptScheme
comment: Types of levels in an academic or training progression expected of, or to be developed by, the typical person for the resource being described.
term status: stable
change history: https://credreg.net/ctdl/termhistory/ceterms/AudienceLevel/json
has concept: Advanced Level
has concept: Associates Degree Level
has concept: Bachelors Degree Level
has concept: Beginner Level
has concept: Doctoral Degree Level
has concept: Intermediate Level
has concept: Masters Degree Level
has concept: Post-Secondary Level
has concept: Secondary School or Equivalent
has top concept: Advanced Level
has top concept: Beginner Level
has top concept: Intermediate Level
has top concept: Post-Secondary Level
has top concept: Secondary School or Equivalent

Advanced Level
type: Concept
definition: Intended for those with significant experience or expertise where developmental expectations are staged for assessing knowledge, skills, or competencies beyond the novice and intermediate levels.
term status: stable
change history: https://credreg.net/ctdl/termhistory/audLevel/AdvancedLevel/json
in scheme: Audience Level
top concept of: Audience Level

Associates Degree Level
type: Concept
definition: Intended for those completing college/university-level programs within their first one to two years (lower-division) of post-secondary education.
term status: stable
change history: https://credreg.net/ctdl/termhistory/audLevel/AssociatesDegreeLevel/json
broader: Post-Secondary Level
in scheme: Audience Level

Bachelors Degree Level
type: Concept
definition: Intended for those completing college/university-level programs within approximately three to four years where course work and activities advance skills from a lower-division or generalist level to an upper-division level.
term status: stable
change history: https://credreg.net/ctdl/termhistory/audLevel/BachelorsDegreeLevel/json
broader: Post-Secondary Level
in scheme: Audience Level

Beginner Level
type: Concept
definition: Intended for novices or those with limited experience.
term status: stable
change history: https://credreg.net/ctdl/termhistory/audLevel/BeginnerLevel/json
in scheme: Audience Level
top concept of: Audience Level

Doctoral Degree Level
type: Concept
definition: Intended for those who have completed Bachelors and Masters degrees or their equivalent and who will be required to complete either independent research or a significant project or paper.
term status: stable
change history: https://credreg.net/ctdl/termhistory/audLevel/DoctoralDegreeLevel/json
broader: Post-Secondary Level
in scheme: Audience Level

Intermediate Level
type: Concept
definition: Intended for those with some experience, where knowledge, skills, and competency expectations are staged for development beyond novice-level and in preparation for a more advanced-level.
description: An individual at this level has foundational competencies to function independently with occasional supervision.
term status: stable
change history: https://credreg.net/ctdl/termhistory/audLevel/IntermediateLevel/json
in scheme: Audience Level
top concept of: Audience Level

Masters Degree Level
type: Concept
definition: Intended for those who have completed a Bachelor's Degree or equivalent.
term status: stable
change history: https://credreg.net/ctdl/termhistory/audLevel/MastersDegreeLevel/json
broader: Post-Secondary Level
in scheme: Audience Level

Post-Secondary Level
type: Concept
definition: Intended for those who have completed secondary level school programs or equivalent.
term status: stable
change history: https://credreg.net/ctdl/termhistory/audLevel/PostSecondaryLevel/json
in scheme: Audience Level
top concept of: Audience Level
narrower: Associates Degree Level
narrower: Bachelors Degree Level
narrower: Doctoral Degree Level
narrower: Masters Degree Level

Secondary School or Equivalent
type: Concept
definition: Intended for those attending secondary (high-school) level programs.
term status: stable
change history: https://credreg.net/ctdl/termhistory/audLevel/SecondaryLevel/json
in scheme: Audience Level
top concept of: Audience Level