Basic Component
type: Class
comment: Resource that identifies a resource not otherwise covered by the enumerated PathwayComponent subclasses.
term status: stable
change history: https://credreg.net/ctdl/termhistory/ceterms/BasicComponent/json
subclass of: PathwayComponent
domain for: componentCategory
domain for: description
domain for: hasCondition
domain for: isDestinationComponentOf
domain for: name
domain for: pointValue
domain for: precedes
domain for: prerequisite
domain for: sourceData
domain for: subjectWebpage