Claim Type
type: ConceptScheme
comment: Types of the claims supported by a verification service.
term status: stable
change history: https://credreg.net/ctdl/termhistory/ceterms/ClaimType/json
has concept: Badge Claim
has concept: Quality Assurance Claim
has concept: Transcript Claim
has concept: Verifiedclaim
has concept: Verified Claim
has top concept: Badge Claim
has top concept: Quality Assurance Claim
has top concept: Transcript Claim
has top concept: Verifiedclaim
has top concept: Verified Claim

Badge Claim
type: Concept
definition: Verifiable visual representation that can be shared, embedded, linked, or otherwise used to publicly indicate that an individual has the represented credential.
term status: stable
change history: https://credreg.net/ctdl/termhistory/claimType/BadgeClaim/json
in scheme: Claim Type
top concept of: Claim Type

Quality Assurance Claim
type: Concept
definition: Verifiable representation of quality assurance.
term status: stable
change history: https://credreg.net/ctdl/termhistory/claimType/QualityAssuranceClaim/json
in scheme: Claim Type
top concept of: Claim Type

Transcript Claim
type: Concept
definition: Verifiable representation of postsecondary courses and degrees completed.
term status: stable
change history: https://credreg.net/ctdl/termhistory/claimType/TranscriptClaim/json
in scheme: Claim Type
top concept of: Claim Type

Verified Claim
type: Concept
definition: Verifiable representation of the credential holder's achievement.
term status: stable
change history: https://credreg.net/ctdl/termhistory/claimType/VerifiedClaim/json
in scheme: Claim Type
top concept of: Claim Type