CredentialPerson
type: Class
comment: Person who plays a role as primary agent in a credentialing action.
description: The ceterms:CredentialPerson class should be used to describe persons directly engaged as primary agent in credentialing actions such as approving, offering, recognizing, renewing and revoking credentials and should not include persons merely affiliated with, or employed by organizations that perform such actions.
term status: stable
change history: https://credreg.net/ctdl/termhistory/ceterms/CredentialPerson/json
subclass of: Agent
subclass of: Person
domain for: affiliation
domain for: familyName
domain for: givenName
domain for: honorificSuffix
domain for: objectOfAction
domain for: targetContactPoint
domain for: worksFor