Credential Status
type: ConceptScheme
comment: Types of applicability statuses of a credential.
term status: stable
change history: https://credreg.net/ctdl/termhistory/ceterms/CredentialStatus/json
has concept: Active
has concept: Deprecated
has concept: Probationary
has concept: Superseded
has top concept: Active
has top concept: Deprecated
has top concept: Probationary
has top concept: Superseded

Active
type: Concept
definition: Awards of the credential are ongoing.
term status: stable
change history: https://credreg.net/ctdl/termhistory/credentialStat/Active/json
in scheme: Credential Status
top concept of: Credential Status

Deprecated
type: Concept
definition: Credential is no longer awarded.
term status: stable
change history: https://credreg.net/ctdl/termhistory/credentialStat/Deprecated/json
in scheme: Credential Status
top concept of: Credential Status

Probationary
type: Concept
definition: Credential award is provisional or temporary; frequently pending further assessment of qualification.
term status: stable
change history: https://credreg.net/ctdl/termhistory/credentialStat/Probationary/json
in scheme: Credential Status
top concept of: Credential Status

Superseded
type: Concept
definition: Credential is no longer awarded and has been superseded by another credential.
term status: stable
change history: https://credreg.net/ctdl/termhistory/credentialStat/Superseded/json
in scheme: Credential Status
top concept of: Credential Status