External Input
type: ConceptScheme
comment: Types of external stakeholders that provide input to the process.
term status: stable
change history: https://credreg.net/ctdl/termhistory/ceterms/ExternalInput/json
has concept: Professional Associations
has concept: Business
has concept: Business or Industry Association
has concept: Consumers
has concept: Education Administrators
has concept: Educators
has concept: Subject Matter Experts
has concept: Governments
has concept: Guardians
has concept: International Bodies
has concept: Practitioners
has concept: Public
has concept: Students
has top concept: Professional Associations
has top concept: Business
has top concept: Business or Industry Association
has top concept: Consumers
has top concept: Education Administrators
has top concept: Educators
has top concept: Subject Matter Experts
has top concept: Governments
has top concept: Guardians
has top concept: International Bodies
has top concept: Practitioners
has top concept: Public
has top concept: Students

Professional Associations
type: Concept
definition: External stakeholder review, guidance or recommendations by professional associations.
term status: stable
change history: https://credreg.net/ctdl/termhistory/inputType/Associations/json
in scheme: External Input
top concept of: External Input

Business
type: Concept
definition: External stakeholder review, guidance or recommendations by business.
term status: stable
change history: https://credreg.net/ctdl/termhistory/inputType/Business/json
in scheme: External Input
top concept of: External Input

Business or Industry Association
type: Concept
definition: External stakeholder review, guidance or recommendations by business or industry association.
term status: stable
change history: https://credreg.net/ctdl/termhistory/inputType/BusinessAssociation/json
in scheme: External Input
top concept of: External Input

Consumers
type: Concept
definition: External stakeholder review, guidance or recommendations by consumers.
term status: stable
change history: https://credreg.net/ctdl/termhistory/inputType/Consumers/json
in scheme: External Input
top concept of: External Input

Education Administrators
type: Concept
definition: External stakeholder review, guidance or recommendations by education administrators.
term status: stable
change history: https://credreg.net/ctdl/termhistory/inputType/EducationAdministrators/json
in scheme: External Input
top concept of: External Input

Educators
type: Concept
definition: External stakeholder review, guidance or recommendations by education instructors or faculty.
term status: stable
change history: https://credreg.net/ctdl/termhistory/inputType/Educators/json
in scheme: External Input
top concept of: External Input

Subject Matter Experts
type: Concept
definition: External stakeholder review, guidance or recommendations by subject matter experts.
term status: stable
change history: https://credreg.net/ctdl/termhistory/inputType/Experts/json
in scheme: External Input
top concept of: External Input

Governments
type: Concept
definition: External stakeholder review, guidance or recommendations by government.
description: May include local, state or provincial, and federal or national government.
term status: stable
change history: https://credreg.net/ctdl/termhistory/inputType/Governments/json
in scheme: External Input
top concept of: External Input

Guardians
type: Concept
definition: External stakeholder review, guidance or recommendations by parents or guardians.
term status: stable
change history: https://credreg.net/ctdl/termhistory/inputType/Guardians/json
in scheme: External Input
top concept of: External Input

International Bodies
type: Concept
definition: External stakeholder review, guidance or recommendations by international bodies.
term status: stable
change history: https://credreg.net/ctdl/termhistory/inputType/InternationalBodies/json
in scheme: External Input
top concept of: External Input

Practitioners
type: Concept
definition: External stakeholder review, guidance or recommendations by practitioners.
term status: stable
change history: https://credreg.net/ctdl/termhistory/inputType/Practitioners/json
in scheme: External Input
top concept of: External Input

Public
type: Concept
definition: External stakeholder review, guidance or recommendations by community members and the general public.
term status: stable
change history: https://credreg.net/ctdl/termhistory/inputType/Public/json
in scheme: External Input
top concept of: External Input

Students
type: Concept
definition: External stakeholder review, guidance or recommendations by all types of learners.
term status: stable
change history: https://credreg.net/ctdl/termhistory/inputType/Students/json
in scheme: External Input
top concept of: External Input