Extracurricular Component
type: Class
comment: Resource that identifies an activity, program, or informal learning experience that may be offered or provided by a school, college, or other organization that is not connected to a curriculum.
description: Instances act as proxies or stand-ins for other resources in the context of a particular pathway so that relationships between them as components of that pathway can be stated without implying that the those relationships are true of the resources in other contexts.
term status: stable
change history: https://credreg.net/ctdl/termhistory/ceterms/ExtracurricularComponent/json
subclass of: PathwayComponent
domain for: hasChild
domain for: isChildOf
domain for: alternateName
domain for: componentCategory
domain for: componentDesignation
domain for: ctid
domain for: description
domain for: hasCondition
domain for: identifier
domain for: isDestinationComponentOf
domain for: isPartOf
domain for: name
domain for: pointValue
domain for: precededBy
domain for: precedes
domain for: proxyFor
domain for: sourceData
domain for: subjectWebpage