Financial Alignment Object
type: Class
comment: An alignment to a financial framework.
description: Examples include, but are not limited to, Free Application for Federal Student Aid (FAFSA) in the U.S.
term status: deprecated
superseded by: FinancialAssistanceProfile
change history: https://credreg.net/ctdl/termhistory/ceterms/FinancialAlignmentObject/json
subclass of: CredentialAlignmentObject
domain for: alignmentDate
domain for: alignmentType
domain for: codedNotation
domain for: framework
domain for: frameworkName
domain for: targetNode
domain for: targetNodeDescription
domain for: targetNodeName
domain for: weight