General Education Level 2 Certificate
type: Class
comment: Credential award at a postsecondary level for successful completion of general education courses that takes at least 1 year that cover a broad range of foundational academic skills and takes less than 2 years to complete.
description: Can lead to a degree. Equivalent to a United States IPEDS Award Level 2 that specifies postsecondary certificates of at least 900 but less than 1,800 clock hours, or at least 30 but less than 60 semester or trimester credit hours, or at least 45 but less than 90 quarter credit hours and UNESCO ISCED 2011 Level 4.
usage note: If the competencies are related to a specific subject area or occupational area use the Technical Level 2 or use a Higher Education Certificate.
term status: unstable
change history: https://credreg.net/ctdl/termhistory/ceterms/GeneralEducationLevel2Certificate/json
subclass of: AcademicCertificate
domain for: accreditedBy
domain for: accreditedIn
domain for: administrationProcess
domain for: advancedStandingFrom
domain for: aggregateData
domain for: alternateName
domain for: appealProcess
domain for: approvedBy
domain for: approvedIn
domain for: approximateDateEffective
domain for: approximateExpirationDate
domain for: assessmentDeliveryType
domain for: atLevel
domain for: audienceLevelType
domain for: audienceType
domain for: availabilityListing
domain for: availableAt
domain for: availableOnlineAt
domain for: broadAlignment
domain for: classification
domain for: commonConditions
domain for: commonCosts
domain for: complaintProcess
domain for: coPrerequisite
domain for: copyrightHolder
domain for: corequisite
domain for: credentialId
domain for: credentialStatusType
domain for: credentialType
domain for: ctid
domain for: dateEffective
domain for: description
domain for: developmentProcess
domain for: earnings
domain for: employmentOutcome
domain for: estimatedCost
domain for: estimatedDuration
domain for: exactAlignment
domain for: expirationDate
domain for: financialAssistance
domain for: hasPart
domain for: hasProxy
domain for: hasRegulatoryInformation
domain for: hasRubric
domain for: hasSupportService
domain for: holders
domain for: identifier
domain for: image
domain for: inCatalog
domain for: industryType
domain for: inLanguage
domain for: instructionalProgramType
domain for: isAdvancedStandingFor
domain for: isicV4
domain for: isPartOf
domain for: isPreparationFor
domain for: isRecommendedFor
domain for: isRequiredFor
domain for: isSimilarTo
domain for: jurisdiction
domain for: keyword
domain for: latestVersion
domain for: learningDeliveryDescription
domain for: learningDeliveryType
domain for: learningMethodDescription
domain for: learningMethodType
domain for: maintenanceProcess
domain for: majorAlignment
domain for: minorAlignment
domain for: naics
domain for: name
domain for: narrowAlignment