Holders Profile
type: Class
comment: Entity describing the count and related statistical information of holders of a given credential.
usage note: The use of ceterms:AggregateDataProfile instead of this class is strongly recommended.
term status: stable
change history: https://credreg.net/ctdl/termhistory/ceterms/HoldersProfile/json
subclass of: AggregateDataProfile
subclass of: CreativeWork
domain for: alternateName
domain for: approximateDateEffective
domain for: approximateExpirationDate
domain for: dateEffective
domain for: demographicInformation
domain for: description
domain for: jurisdiction
domain for: name
domain for: numberAwarded
domain for: region
domain for: source