Industry Classification
type: Class
comment: Class of of concept schemes defining industries such as NAICS in the U.S. and ESCO in the European Union.
term status: stable
change history: https://credreg.net/ctdl/termhistory/ceterms/IndustryClassification/json
subclass of: CredentialFramework