Intended Purpose
type: ConceptScheme
comment: Types of intended purpose of the credential holder in earning the credential.
term status: unstable
change history: https://credreg.net/ctdl/termhistory/ceterms/IntendedPurpose/json
has concept: General Education
has concept: Job/Career Preparation
has concept: Mid-Career Level
has concept: Prior Learning Experience
has top concept: General Education
has top concept: Job/Career Preparation
has top concept: Mid-Career Level
has top concept: Prior Learning Experience

General Education
type: Concept
definition: Purpose of the credential as identified by the relevant agent is for the general education of the holder.
term status: unstable
change history: https://credreg.net/ctdl/termhistory/purpose/GeneralEducation/json
in scheme: Intended Purpose
top concept of: Intended Purpose

Job/Career Preparation
type: Concept
definition: Purpose of the credential as identified by the relevant agent is for job or career preparation of the holder.
term status: unstable
change history: https://credreg.net/ctdl/termhistory/purpose/JobOrCareerPreparation/json
in scheme: Intended Purpose
top concept of: Intended Purpose

Mid-Career Level
type: Concept
definition: Purpose of the credential as identified by the relevant agent is for mid-career, experienced worker preparation and advancement of the holder.
term status: unstable
change history: https://credreg.net/ctdl/termhistory/purpose/MidCareer/json
in scheme: Intended Purpose
top concept of: Intended Purpose

Prior Learning Experience
type: Concept
definition: Purpose of the credential as identified by the relevant agent is for determining prior learning experience of the holder.
description: Includes, but is not limited to, college credit.
term status: unstable
change history: https://credreg.net/ctdl/termhistory/purpose/PriorExperience/json
in scheme: Intended Purpose
top concept of: Intended Purpose