Jurisdiction Profile
type: Class
comment: Geo-political information about applicable geographic areas and their exceptions.
term status: stable
change history: https://credreg.net/ctdl/termhistory/ceterms/JurisdictionProfile/json
subclass of: CreativeWork
domain for: assertedBy
domain for: description
domain for: globalJurisdiction
domain for: jurisdictionException
domain for: mainJurisdiction