Learning Opportunity Profile
type: Class
comment: Entity describing an educational or training opportunity.
description: Opportunities include formal and informal educational training programs and classes, apprenticeship or work experience programs, or other structured or unstructured experiences that serve as educational or training activities.
term status: stable
change history: https://credreg.net/ctdl/termhistory/ceterms/LearningOpportunityProfile/json
subclass of: CreativeWork
domain for: accreditedBy
domain for: accreditedIn
domain for: advancedStandingFrom
domain for: approvedBy
domain for: approvedIn
domain for: audienceType
domain for: availabilityListing
domain for: availableAt
domain for: availableOnlineAt
domain for: codedNotation
domain for: commonConditions
domain for: commonCosts
domain for: corequisite
domain for: creditHourType
domain for: creditHourValue
domain for: creditUnitType
domain for: creditUnitTypeDescription
domain for: creditUnitValue
domain for: ctid
domain for: dateEffective
domain for: deliveryType
domain for: deliveryTypeDescription
domain for: description
domain for: entryCondition
domain for: estimatedCost
domain for: estimatedDuration
domain for: financialAssistance
domain for: hasPart
domain for: industryType
domain for: inLanguage
domain for: instructionalProgramType
domain for: isAdvancedStandingFor
domain for: isPartOf
domain for: isPreparationFor
domain for: isRecommendedFor
domain for: isRequiredFor
domain for: jurisdiction
domain for: keyword
domain for: learningMethodType
domain for: name
domain for: occupationType
domain for: offeredBy
domain for: offeredIn
domain for: ownedBy
domain for: preparationFrom
domain for: recognizedBy
domain for: recognizedIn
domain for: recommends
domain for: region
domain for: regulatedBy
domain for: regulatedIn
domain for: requires
domain for: subject
domain for: subjectWebpage
domain for: targetAssessment
domain for: targetLearningOpportunity
domain for: targetLearningResource
domain for: teaches
domain for: verificationMethodDescription
domain for: versionIdentifier