Learning Recognition Outcome Category
type: ConceptScheme
comment: Concepts describing outcomes of learning recognition.
term status: unstable
change history: https://credreg.net/ctdl/termhistory/ceterms/LearningRecognitionOutcomeCategory/json
has concept: Advanced Standing
has concept: Credit Awarded
has concept: Credit Equivalency
has concept: Eligibility Met
has concept: Exemption Waiver
has concept: Not Recognized
has concept: Placement
has concept: Recognition Only
has top concept: Advanced Standing
has top concept: Credit Awarded
has top concept: Credit Equivalency
has top concept: Eligibility Met
has top concept: Exemption Waiver
has top concept: Not Recognized
has top concept: Placement
has top concept: Recognition Only

Advanced Standing
type: Concept
definition: An outcome in which standing toward a program or qualification is granted, which may or may not carry transcripted credit.
term status: unstable
change history: https://credreg.net/ctdl/termhistory/lrOutcome/AdvancedStanding/json
in scheme: Learning Recognition Outcome Category
top concept of: Learning Recognition Outcome Category

Credit Awarded
type: Concept
definition: An outcome in which learning results in transcripted credit.
term status: unstable
change history: https://credreg.net/ctdl/termhistory/lrOutcome/CreditAwarded/json
in scheme: Learning Recognition Outcome Category
top concept of: Learning Recognition Outcome Category

Credit Equivalency
type: Concept
definition: An outcome in which learning fulfills a credit requirement.
term status: unstable
change history: https://credreg.net/ctdl/termhistory/lrOutcome/CreditEquivalency/json
in scheme: Learning Recognition Outcome Category
top concept of: Learning Recognition Outcome Category

Eligibility Met
type: Concept
definition: An outcome in which a prerequisite, admission, or other eligibility requirement is satisfied by recognized learning.
term status: unstable
change history: https://credreg.net/ctdl/termhistory/lrOutcome/EligibilityMet/json
in scheme: Learning Recognition Outcome Category
top concept of: Learning Recognition Outcome Category

Exemption Waiver
type: Concept
definition: An outcome in which a requirement is waived.
term status: unstable
change history: https://credreg.net/ctdl/termhistory/lrOutcome/ExemptionWaiver/json
in scheme: Learning Recognition Outcome Category
top concept of: Learning Recognition Outcome Category

Not Recognized
type: Concept
definition: An outcome in which an evaluation is completed but no recognition is granted.
term status: unstable
change history: https://credreg.net/ctdl/termhistory/lrOutcome/NotRecognized/json
in scheme: Learning Recognition Outcome Category
top concept of: Learning Recognition Outcome Category

Placement
type: Concept
definition: An outcome in which a person is placed into a program, hired or promoted.
term status: unstable
change history: https://credreg.net/ctdl/termhistory/lrOutcome/Placement/json
in scheme: Learning Recognition Outcome Category
top concept of: Learning Recognition Outcome Category

Recognition Only
type: Concept
definition: An outcome in which learning is acknowledged for placement, exemption, or eligibility without awarding credit.
term status: unstable
change history: https://credreg.net/ctdl/termhistory/lrOutcome/RecognitionOnly/json
in scheme: Learning Recognition Outcome Category
top concept of: Learning Recognition Outcome Category