Logical Operator Category
type: ConceptScheme
comment: Logical operators applicable to two or more items.
usage note: Used in CTDL for types of logical operator for combining two or more nested ComponentCondition entities, Constraint entities, or a mix of ComponentCondition and Constraint entities.
term status: unstable
change history: https://credreg.net/ctdl/termhistory/ceterms/LogicalOperatorCategory/json
has concept: And
has concept: Only One
has concept: Or
has top concept: And
has top concept: Only One
has top concept: Or

And
type: Concept
definition: Relation is satisfied when all of the conditions and constraints are satisfied.
usage note: When used in a Component Condition, this applies to the combination of all immediately subordinate Component Conditions and Constraints.
term status: unstable
change history: https://credreg.net/ctdl/termhistory/logic/And/json
equivalent class: and
in scheme: Logical Operator Category
top concept of: Logical Operator Category

Only One
type: Concept
definition: Relation is satisfied when exactly one, and not more, of the conditions or constraints is satisfied.
usage note: When used in a Component Condition, this applies to the combination of all immediately subordinate Component Conditions and Constraints.
term status: unstable
change history: https://credreg.net/ctdl/termhistory/logic/OnlyOne/json
equivalent class: xone
in scheme: Logical Operator Category
top concept of: Logical Operator Category

Or
type: Concept
definition: Relation is satisfied when at least one of the conditions or constraints is satisfied.
usage note: When used in a Component Condition, this applies to the combination of all immediately subordinate Component Conditions and Constraints.
term status: unstable
change history: https://credreg.net/ctdl/termhistory/logic/Or/json
equivalent class: or
in scheme: Logical Operator Category
top concept of: Logical Operator Category