Occupation Classification
type: Class
comment: Class of concept schemes identifying occupations such as the Standard Occupational Classification (SOC) system in the U.S. and the European Skills/Competences, Qualifications and Occupations (ESCO).
term status: stable
change history: https://credreg.net/ctdl/termhistory/ceterms/OccupationClassification/json
subclass of: CredentialFramework