Registration Action
type: Class
comment: Action by an independent, neutral, and authoritative agent that registers a resource that has been vetted, approved, and validated to meet specific criteria.
term status: unstable
change history: https://credreg.net/ctdl/termhistory/ceterms/RegistrationAction/json
subclass of: CredentialingAction
domain for: actingAgent
domain for: actionStatusType
domain for: administrationProcess
domain for: ctid
domain for: description
domain for: endDate
domain for: evidenceOfAction
domain for: instrument
domain for: name
domain for: object
domain for: participant
domain for: startDate