Residency
type: ConceptScheme
comment: Types of residency.
term status: stable
change history: https://credreg.net/ctdl/termhistory/ceterms/Residency/json
has concept: In-State
has concept: Foreign/International
has concept: Local
has concept: Out-of-State
has concept: Regional
has top concept: In-State
has top concept: Foreign/International
has top concept: Local
has top concept: Out-of-State
has top concept: Regional

In-State
type: Concept
definition: Legal residency or domicile status of the agent is the state or province of the relevant activity.
term status: stable
change history: https://credreg.net/ctdl/termhistory/residency/InState/json
in scheme: Residency
top concept of: Residency

Foreign/International
type: Concept
definition: Legal residency, domicile, or citizen status of the agent is as a foreign national.
term status: stable
change history: https://credreg.net/ctdl/termhistory/residency/International/json
in scheme: Residency
top concept of: Residency

Local
type: Concept
definition: Legal residency or domicile status of the agent is local.
term status: stable
change history: https://credreg.net/ctdl/termhistory/residency/Local/json
in scheme: Residency
top concept of: Residency

Out-of-State
type: Concept
definition: Legal residency or domicile status of the agent is a state or province different from the state or provincial locus of the relevant activity.
term status: stable
change history: https://credreg.net/ctdl/termhistory/residency/OutOfState/json
in scheme: Residency
top concept of: Residency

Regional
type: Concept
definition: Legal residency or domicile status of the agent is the same geographic or political region as that of the relevant activity.
term status: stable
change history: https://credreg.net/ctdl/termhistory/residency/Regional/json
in scheme: Residency
top concept of: Residency