Revocation Profile
type: Class
comment: Entity describing conditions and methods by which a credential can be removed from a holder.
term status: stable
change history: https://credreg.net/ctdl/termhistory/ceterms/RevocationProfile/json
subclass of: CreativeWork
domain for: dateEffective
domain for: description
domain for: jurisdiction
domain for: region
domain for: revocationCriteria
domain for: revocationCriteriaDescription