Revoke Action
type: Class
comment: Action by an agent removing an awarded credential (credential assertion) from the credential holder based on violations or failure of the holder to renew.
description: Since an instance of ceterms:CredentialingAction is a claim that a certain agent has taken the action being described, creation of such a ceterms:CredentialingAction should be reserved to the agent of that action.
term status: stable
change history: https://credreg.net/ctdl/termhistory/ceterms/RevokeAction/json
subclass of: CredentialingAction
domain for: actingAgent
domain for: actionStatusType
domain for: description
domain for: endDate
domain for: evidenceOfAction
domain for: instrument
domain for: object
domain for: participant
domain for: startDate