Rights Action
type: Class
comment: Action asserting legal rights by an agent to possess, defend, transfer, license, and grant conditional access to a credential, learning opportunity, or assessment.
description: Since an instance of ceterms:CredentialingAction is a claim that a certain agent has taken the action being described, creation of such a ceterms:CredentialingAction should be reserved to the agent of that action.
term status: stable
change history: https://credreg.net/ctdl/termhistory/ceterms/RightsAction/json
subclass of: CredentialingAction
domain for: actingAgent
domain for: actionStatusType
domain for: administrationProcess
domain for: approximateEndDate
domain for: approximateStartDate
domain for: classification
domain for: ctid
domain for: description
domain for: endDate
domain for: evidenceOfAction
domain for: hasRegulatoryInformation
domain for: identifier
domain for: instrument
domain for: isSimilarTo
domain for: name
domain for: object
domain for: participant
domain for: startDate