Schedule Frequency
type: ConceptScheme
comment: Types for how often events occur.
term status: unstable
change history: https://credreg.net/ctdl/termhistory/ceterms/ScheduleFrequency/json
has concept: Annually
has concept: Bi-Monthly
has concept: Bi-Weekly
has concept: Daily
has concept: Event-Based
has concept: Hourly
has concept: Irregular
has concept: Monthly
has concept: Multiple Per Week
has concept: On-Demand
has concept: Open Entry/Exit
has concept: Quarterly
has concept: Self-Paced
has concept: Semi-Annually
has concept: Semi-Monthly
has concept: Single Instance
has concept: Weekly
has top concept: Annually
has top concept: Bi-Monthly
has top concept: Bi-Weekly
has top concept: Daily
has top concept: Event-Based
has top concept: Hourly
has top concept: Irregular
has top concept: Monthly
has top concept: Multiple Per Week
has top concept: On-Demand
has top concept: Open Entry/Exit
has top concept: Quarterly
has top concept: Self-Paced
has top concept: Semi-Annually
has top concept: Semi-Monthly
has top concept: Single Instance
has top concept: Weekly

Annually
type: Concept
definition: Schedule is on an annual basis, typically occurring once per year.
term status: unstable
change history: https://credreg.net/ctdl/termhistory/scheduleFrequency/Annually/json
in scheme: Schedule Frequency
top concept of: Schedule Frequency

Bi-Monthly
type: Concept
definition: Schedule is on a bi-monthly basis, typically occurring every other month.
term status: unstable
change history: https://credreg.net/ctdl/termhistory/scheduleFrequency/BiMonthly/json
in scheme: Schedule Frequency
top concept of: Schedule Frequency

Bi-Weekly
type: Concept
definition: Schedule is on a bi-weekly basis, typically occurring every other week.
term status: unstable
change history: https://credreg.net/ctdl/termhistory/scheduleFrequency/BiWeekly/json
in scheme: Schedule Frequency
top concept of: Schedule Frequency

Daily
type: Concept
definition: Schedule is on a daily basis, typically occurring once per day.
term status: unstable
change history: https://credreg.net/ctdl/termhistory/scheduleFrequency/Daily/json
in scheme: Schedule Frequency
top concept of: Schedule Frequency

Event-Based
type: Concept
definition: Schedule is determined or triggered by other events, such as completion of activities, completion of the resource, events external to the resource, or other events; refer to the resource's information for details.
term status: unstable
change history: https://credreg.net/ctdl/termhistory/scheduleFrequency/EventBased/json
in scheme: Schedule Frequency
top concept of: Schedule Frequency

Hourly
type: Concept
definition: Schedule is on a hourly basis, typically occurring once per hour.
term status: unstable
change history: https://credreg.net/ctdl/termhistory/scheduleFrequency/Hourly/json
in scheme: Schedule Frequency
top concept of: Schedule Frequency

Irregular
type: Concept
definition: Schedule has no significant pattern.
term status: unstable
change history: https://credreg.net/ctdl/termhistory/scheduleFrequency/Irregular/json
in scheme: Schedule Frequency
top concept of: Schedule Frequency

Monthly
type: Concept
definition: Schedule is on a monthly basis, typically occurring once per month.
term status: unstable
change history: https://credreg.net/ctdl/termhistory/scheduleFrequency/Monthly/json
in scheme: Schedule Frequency
top concept of: Schedule Frequency

Multiple Per Week
type: Concept
definition: Schedule is more frequent than a weekly basis.
term status: unstable
change history: https://credreg.net/ctdl/termhistory/scheduleFrequency/MultiplePerWeek/json
in scheme: Schedule Frequency
top concept of: Schedule Frequency

On-Demand
type: Concept
definition: Schedule allows the participant to choose when the resource begins.
term status: unstable
change history: https://credreg.net/ctdl/termhistory/scheduleFrequency/OnDemand/json
in scheme: Schedule Frequency
top concept of: Schedule Frequency

Open Entry/Exit
type: Concept
definition: Schedule allows for the participant to enter, participate with, and complete the resource during any period of the resource's run time.
term status: unstable
change history: https://credreg.net/ctdl/termhistory/scheduleFrequency/OpenEntryExit/json
in scheme: Schedule Frequency
top concept of: Schedule Frequency

Quarterly
type: Concept
definition: Schedule is on an quarterly basis, typically occurring three or four times per year.
term status: unstable
change history: https://credreg.net/ctdl/termhistory/scheduleFrequency/Quarterly/json
in scheme: Schedule Frequency
top concept of: Schedule Frequency

Self-Paced
type: Concept
definition: Schedule allows for participation at a self-determined pace, though some specific dates and deadlines may be involved.
term status: unstable
change history: https://credreg.net/ctdl/termhistory/scheduleFrequency/SelfPaced/json
in scheme: Schedule Frequency
top concept of: Schedule Frequency

Semi-Annually
type: Concept
definition: Schedule is on an semi-annual basis, typically occurring twice per year.
term status: unstable
change history: https://credreg.net/ctdl/termhistory/scheduleFrequency/SemiAnnually/json
in scheme: Schedule Frequency
top concept of: Schedule Frequency

Semi-Monthly
type: Concept
definition: Schedule is on a semi-monthly basis, typically occurring twice per month.
term status: unstable
change history: https://credreg.net/ctdl/termhistory/scheduleFrequency/SemiMonthly/json
in scheme: Schedule Frequency
top concept of: Schedule Frequency

Single Instance
type: Concept
definition: Schedule is a single instance of this event.
term status: unstable
change history: https://credreg.net/ctdl/termhistory/scheduleFrequency/SingleInstance/json
in scheme: Schedule Frequency
top concept of: Schedule Frequency

Weekly
type: Concept
definition: Schedule is on a weekly basis, typically occurring once per week.
term status: unstable
change history: https://credreg.net/ctdl/termhistory/scheduleFrequency/Weekly/json
in scheme: Schedule Frequency
top concept of: Schedule Frequency