Schedule Timing
type: ConceptScheme
comment: Types for when (in time) events occur.
term status: unstable
change history: https://credreg.net/ctdl/termhistory/ceterms/ScheduleTiming/json
has concept: Daytime
has concept: Evening
has concept: Weekdays
has concept: Weekends
has top concept: Daytime
has top concept: Evening
has top concept: Weekdays
has top concept: Weekends

Daytime
type: Concept
definition: Schedule is typically during daytime hours.
term status: unstable
change history: https://credreg.net/ctdl/termhistory/scheduleTiming/Daytime/json
in scheme: Schedule Timing
top concept of: Schedule Timing

Evening
type: Concept
definition: Schedule is typically during evening hours.
term status: unstable
change history: https://credreg.net/ctdl/termhistory/scheduleTiming/Evening/json
in scheme: Schedule Timing
top concept of: Schedule Timing

Weekdays
type: Concept
definition: Schedule is Monday through Friday, consecutively or non-consecutively.
term status: unstable
change history: https://credreg.net/ctdl/termhistory/scheduleTiming/Weekdays/json
in scheme: Schedule Timing
top concept of: Schedule Timing

Weekends
type: Concept
definition: Schedule is on a weekly basis, Saturday and/or Sunday.
term status: unstable
change history: https://credreg.net/ctdl/termhistory/scheduleTiming/Weekends/json
in scheme: Schedule Timing
top concept of: Schedule Timing