Verification Service Profile
type: Class
comment: Entity describing the means by which someone can verify whether a credential has been attained.
description: Includes, but is not limited to, verification of whether quality assurance credentials have been issued for organizations, learning opportunities, and assessments.
term status: stable
change history: https://credreg.net/ctdl/termhistory/ceterms/VerificationServiceProfile/json
subclass of: Intangible
domain for: dateEffective
domain for: description
domain for: estimatedCost
domain for: holderMustAuthorize
domain for: jurisdiction
domain for: offeredBy
domain for: offeredIn
domain for: region
domain for: subjectWebpage
domain for: targetCredential
domain for: verificationDirectory
domain for: verificationMethodDescription
domain for: verificationService
domain for: verifiedClaimType