Work Experience Component
type: Class
comment: Resource describing an activity or training through which a person gains job experience.
term status: stable
change history: https://credreg.net/ctdl/termhistory/ceterms/WorkExperienceComponent/json
subclass of: PathwayComponent
domain for: hasChild
domain for: isChildOf
domain for: codedNotation
domain for: componentDesignation
domain for: ctid
domain for: description
domain for: hasCondition
domain for: isDestinationComponentOf
domain for: isPartOf
domain for: name
domain for: pointValue
domain for: precedes
domain for: prerequisite
domain for: sourceData
domain for: subjectWebpage