Address
type: Property
comment: Particulars describing the location of the place.
term status: stable
change history: https://credreg.net/ctdl/termhistory/ceterms/address/json
domain includes: CredentialOrganization
domain includes: QACredentialOrganization
range includes: Place
equivalent property: address