Address Country
type: Property
comment: Nation with its own government and occupying a particular territory identified by the two-letter ISO 3166-1 alpha-2 country code.
term status: stable
change history: https://credreg.net/ctdl/termhistory/ceterms/addressCountry/json
domain includes: Place
domain includes: PostalAddress
range includes: langString
equivalent property: addressCountry