Address Region
type: Property
comment: State or province in which a particular location is situtated.
term status: stable
change history: https://credreg.net/ctdl/termhistory/ceterms/addressRegion/json
domain includes: Place
domain includes: PostalAddress
range includes: langString
equivalent property: addressRegion