Administration Process
type: Property
comment: Description of a process by which a resource is administered.
description: Processes described include the execution of events and the development of resources in the lifecycle of a credential or organization, such as the process for the proctoring of assessments.
usage note: For assessments and rubrics, this can be used to indicate the scoring algorithm.
term status: stable
change history: https://credreg.net/ctdl/termhistory/ceterms/administrationProcess/json
domain includes: Rubric
domain includes: AcademicCertificate
domain includes: AccreditAction
domain includes: AdvancedStandingAction
domain includes: ApprenticeshipCertificate
domain includes: ApproveAction
domain includes: AssessmentProfile
domain includes: AssociateDegree
domain includes: AssociateOfAppliedArtsDegree
domain includes: AssociateOfAppliedScienceDegree
domain includes: AssociateOfArtsDegree
domain includes: AssociateOfScienceDegree
domain includes: BachelorDegree
domain includes: BachelorOfArtsDegree
domain includes: BachelorOfScienceDegree
domain includes: Badge
domain includes: BasicTechnicalCertificate
domain includes: Certificate
domain includes: CertificateOfCompletion
domain includes: CertificateOfParticipation
domain includes: Certification
domain includes: Credential
domain includes: CredentialingAction
domain includes: CredentialOrganization
domain includes: CredentialType
domain includes: Degree
domain includes: DigitalBadge
domain includes: Diploma
domain includes: DoctoralDegree
domain includes: GeneralEducationDevelopment
domain includes: GeneralEducationLevel1Certificate
domain includes: GeneralEducationLevel2Certificate
domain includes: HigherEducationLevel1Certificate
domain includes: HigherEducationLevel2Certificate
domain includes: JourneymanCertificate
domain includes: License
domain includes: MasterCertificate
domain includes: MasterDegree
domain includes: MasterOfArtsDegree
domain includes: MasterOfScienceDegree
domain includes: MicroCredential
domain includes: OfferAction
domain includes: OpenBadge
domain includes: Organization
domain includes: PostBaccalaureateCertificate
domain includes: PostMasterCertificate
domain includes: PreApprenticeshipCertificate
domain includes: ProfessionalCertificate
domain includes: ProfessionalDoctorate
domain includes: ProficiencyCertificate
domain includes: QACredentialOrganization
domain includes: QualificationsFramework
domain includes: QualityAssuranceCredential
domain includes: RecognizeAction
domain includes: RegistrationAction
domain includes: RegulateAction
domain includes: RegulatoryInformation
domain includes: RenewAction
domain includes: ResearchDoctorate
domain includes: RevokeAction
domain includes: RightsAction
domain includes: SecondaryEducationCertificate
domain includes: SecondarySchoolDiploma
domain includes: SpecialistDegree
domain includes: SupportService
domain includes: TechnicalLevel1Certificate
domain includes: TechnicalLevel2Certificate
domain includes: TechnicalLevel3Certificate
domain includes: TransferValueProfile
domain includes: VerificationServiceProfile
domain includes: WorkBasedLearningCertificate
domain includes: WorkforceDemandAction
domain includes: DataSetProfile