Affiliated Agent
type: Property
comment: Organization or person that plays some role in assigning, performing, assisting with, facilitating, approving of, or otherwise being involved with the task being described.
term status: stable
change history: https://credreg.net/ctdl/termhistory/ceterms/affiliatedAgent/json
domain includes: TaskProfile
range includes: CredentialOrganization
range includes: CredentialPerson
range includes: QACredentialOrganization