Affiliation
type: Property
comment: Organization to which a person is formally related through work, sudy, or social engagement.
term status: stable
change history: https://credreg.net/ctdl/termhistory/ceterms/affiliation/json
sub property of: affiliation
domain includes: ConditionProfile
domain includes: CredentialPerson
range includes: CredentialOrganization
range includes: Organization
range includes: QACredentialOrganization