Agent Purpose
type: Property
comment: Organization's primary purpose as found on an "about" page of a website.
term status: stable
change history: https://credreg.net/ctdl/termhistory/ceterms/agentPurpose/json
domain includes: CredentialOrganization
domain includes: QACredentialOrganization
range includes: anyURI