Agent Purpose Description
type: Property
comment: Short, key phrases describing the primary purpose of an organization as might be derived from the "about" page of it's website.
term status: stable
change history: https://credreg.net/ctdl/termhistory/ceterms/agentPurposeDescription/json
domain includes: CredentialOrganization
domain includes: QACredentialOrganization
range includes: langString