Agent Sector Type
type: Property
comment: Type of sociological, economic, or political subdivision served by an organization; select from an existing enumeration of such types.
usage note: Recommended best practice for credentials in the Credential Engine Registry is to use concepts from the ceterms:AgentSector vocabulary.
term status: stable
change history: https://credreg.net/ctdl/termhistory/ceterms/agentSectorType/json
sub property of: credentialAlignment
domain includes: CredentialOrganization
domain includes: QACredentialOrganization
range includes: CredentialAlignmentObject
target scheme: AgentSector