Agent Type
type: Property
comment: Type of organization such as educational institution, credentialing organization or quality assurance body; select from an existing enumeration of such types.
usage note: Best practice for developing credential descriptions for the Credential Engine Registry is to use the ceterms:OrganizationType vocabulary.
term status: stable
change history: https://credreg.net/ctdl/termhistory/ceterms/agentType/json
domain includes: CredentialOrganization
domain includes: QACredentialOrganization
range includes: CredentialAlignmentObject
target scheme: OrganizationType