Alignment Type
type: Property
comment: Type of relationship between two entities.
usage note: This property is necessary only for AlignmentObjects as part of an AlignmentMap where it is the property that expresses the alignment from the source node (as subject) and target node (as object). When the CredentialAlignmentObject is used, the type value is definitively identified by the property that points to it and so in this case the alignmentType property is redundant.
term status: stable
change history: https://credreg.net/ctdl/termhistory/ceterms/alignmentType/json
domain includes: AlignmentObject
domain includes: CredentialAlignmentObject
domain includes: FinancialAlignmentObject
range includes: Concept
target scheme: Alignment
equivalent property: alignmentType